Stages & jobs

  1. Default Stage

Build result summary

Details

Completed
Duration
26 minutes
Labels
None
Revision
5cba976be419023e8e4121e0ae5d6676abbf3ead 5cba976be419023e8e4121e0ae5d6676abbf3ead
Total tests
10272
Fixed in
#1322 (Changes by Rainer Prosi <rainer.prosi@heidelberg.com>)

Responsible

No one has taken responsibility for this failure

Code commits

Author Commit Message Commit date
Rainer Prosi <rainer.prosi@heidelberg.com> Rainer Prosi <rainer.prosi@heidelberg.com> 5cba976be419023e8e4121e0ae5d6676abbf3ead 5cba976be419023e8e4121e0ae5d6676abbf3ead zip and queue fixes

Tests

New test failures 6
Status Test View job Duration
Collapse Failed ZipReaderTest testunpackBackslash History
build LINUX < 1 sec
java.lang.AssertionError: expected:<1> but was:<2>
	at org.cip4.jdflib.util.zip.ZipReaderTest.testunpackBackslash(ZipReaderTest.java:364)
Collapse Failed ZipReaderTest testunpack History
build LINUX < 1 sec
java.lang.AssertionError: expected:<1> but was:<3>
	at org.cip4.jdflib.util.zip.ZipReaderTest.testunpack(ZipReaderTest.java:86)
Collapse Failed ZipReaderTest testunpackBackslash History
build MACOSX < 1 sec
java.lang.AssertionError: expected:<1> but was:<2>
	at org.cip4.jdflib.util.zip.ZipReaderTest.testunpackBackslash(ZipReaderTest.java:364)
Collapse Failed ZipReaderTest testunpack History
build MACOSX < 1 sec
java.lang.AssertionError: expected:<1> but was:<3>
	at org.cip4.jdflib.util.zip.ZipReaderTest.testunpack(ZipReaderTest.java:86)
Collapse Failed ZipReaderTest testunpackBackslash History
build WINDOWS < 1 sec
java.lang.AssertionError: expected:<1> but was:<2>
	at org.cip4.jdflib.util.zip.ZipReaderTest.testunpackBackslash(ZipReaderTest.java:364)
Collapse Failed ZipReaderTest testunpack History
build WINDOWS < 1 sec
java.lang.AssertionError: expected:<1> but was:<3>
	at org.cip4.jdflib.util.zip.ZipReaderTest.testunpack(ZipReaderTest.java:86)

Shared artifacts

Artifact File size
doc 0 bytes
src 0 bytes
jar 0 bytes
samples 138 KB