Stages & jobs

  1. Default Stage

Test results

  • 10.275 tests in total
  • 57 tests failed
  • 57 failures are new
  • 18 tests were quarantined / skipped
  • 33 minutes taken in total.
New test failures 57
Status Test View job Duration
Collapse Failed VarnishTest testCombinedVarnish History
build LINUX 1 sec
org.junit.ComparisonFailure: expected:<[Error]> but was:<[Valid]>
	at org.cip4.jdflib.examples.VarnishTest.testCombinedVarnish(VarnishTest.java:176)
Collapse Failed VarnishTest testCombinedVarnish History
build MACOSX 1 sec
org.junit.ComparisonFailure: expected:<[Error]> but was:<[Valid]>
	at org.cip4.jdflib.examples.VarnishTest.testCombinedVarnish(VarnishTest.java:176)
Collapse Failed VarnishTest testCombinedVarnish History
build WINDOWS 2 secs
org.junit.ComparisonFailure: expected:<[Error]> but was:<[Valid]>
	at org.cip4.jdflib.examples.VarnishTest.testCombinedVarnish(VarnishTest.java:176)
Collapse Failed XJDFTest testFromXJDFMedia History
build LINUX < 1 sec
java.lang.AssertionError
	at org.cip4.jdflib.extensions.XJDFTest.testFromXJDFMedia(XJDFTest.java:600)
Collapse Failed XJDFTest testDependencies History
build LINUX < 1 sec
java.lang.AssertionError
	at org.cip4.jdflib.extensions.XJDFTest.testDependencies(XJDFTest.java:909)
Collapse Failed XJDFTest testDependencies History
build MACOSX < 1 sec
java.lang.AssertionError
	at org.cip4.jdflib.extensions.XJDFTest.testDependencies(XJDFTest.java:909)
Collapse Failed XJDFTest testFromXJDFMedia History
build MACOSX < 1 sec
java.lang.AssertionError
	at org.cip4.jdflib.extensions.XJDFTest.testFromXJDFMedia(XJDFTest.java:600)
Collapse Failed XJDFTest testDependencies History
build WINDOWS < 1 sec
java.lang.AssertionError
	at org.cip4.jdflib.extensions.XJDFTest.testDependencies(XJDFTest.java:909)
Collapse Failed XJDFTest testFromXJDFMedia History
build WINDOWS < 1 sec
java.lang.AssertionError
	at org.cip4.jdflib.extensions.XJDFTest.testFromXJDFMedia(XJDFTest.java:600)
Collapse Failed XJDFAdditionalExampleTest testSeparationSplit History
build LINUX < 1 sec
org.junit.ComparisonFailure: expected:<[Error]> but was:<[Valid]>
	at org.cip4.jdflib.extensions.examples.XJDFAdditionalExampleTest.testSeparationSplit(XJDFAdditionalExampleTest.java:137)
Collapse Failed XJDFAdditionalExampleTest testSeparationSplit History
build MACOSX < 1 sec
org.junit.ComparisonFailure: expected:<[Error]> but was:<[Valid]>
	at org.cip4.jdflib.extensions.examples.XJDFAdditionalExampleTest.testSeparationSplit(XJDFAdditionalExampleTest.java:137)
Collapse Failed XJDFAdditionalExampleTest testSeparationSplit History
build WINDOWS < 1 sec
org.junit.ComparisonFailure: expected:<[Error]> but was:<[Valid]>
	at org.cip4.jdflib.extensions.examples.XJDFAdditionalExampleTest.testSeparationSplit(XJDFAdditionalExampleTest.java:137)
Collapse Failed JDFToXJDFConverterTest testCleanupFalse History
build LINUX < 1 sec
java.lang.AssertionError
	at org.cip4.jdflib.extensions.xjdfwalker.JDFToXJDFConverterTest.testCleanupFalse(JDFToXJDFConverterTest.java:952)
Collapse Failed JDFToXJDFConverterTest testMediaInline History
build LINUX < 1 sec
java.lang.AssertionError
	at org.cip4.jdflib.extensions.xjdfwalker.JDFToXJDFConverterTest.testMediaInline(JDFToXJDFConverterTest.java:1844)
Collapse Failed JDFToXJDFConverterTest testMediaComponentIn History
build LINUX < 1 sec
java.lang.NullPointerException
	at org.cip4.jdflib.extensions.xjdfwalker.JDFToXJDFConverterTest.testMediaComponentIn(JDFToXJDFConverterTest.java:1767)
Collapse Failed JDFToXJDFConverterTest testColorPoolSpace History
build LINUX < 1 sec
org.junit.ComparisonFailure: expected:<[Error]> but was:<[Valid]>
	at org.cip4.jdflib.extensions.xjdfwalker.JDFToXJDFConverterTest.testColorPoolSpace(JDFToXJDFConverterTest.java:1119)
Collapse Failed JDFToXJDFConverterTest testColorantControl History
build LINUX < 1 sec
org.junit.ComparisonFailure: expected:<[Error]> but was:<[Valid]>
	at org.cip4.jdflib.extensions.xjdfwalker.JDFToXJDFConverterTest.testColorantControl(JDFToXJDFConverterTest.java:1026)
Collapse Failed JDFToXJDFConverterTest testLayoutMedia History
build LINUX < 1 sec
java.lang.AssertionError
	at org.cip4.jdflib.extensions.xjdfwalker.JDFToXJDFConverterTest.testLayoutMedia(JDFToXJDFConverterTest.java:1992)
Collapse Failed JDFToXJDFConverterTest testRefMediaFromInline History
build LINUX < 1 sec
org.junit.ComparisonFailure: expected:<[Error]> but was:<[Valid]>
	at org.cip4.jdflib.extensions.xjdfwalker.JDFToXJDFConverterTest.testRefMediaFromInline(JDFToXJDFConverterTest.java:215)
Collapse Failed JDFToXJDFConverterTest testColorantControlRefPool History
build LINUX < 1 sec
org.junit.ComparisonFailure: expected:<[Error]> but was:<[Valid]>
	at org.cip4.jdflib.extensions.xjdfwalker.JDFToXJDFConverterTest.testColorantControlRefPool(JDFToXJDFConverterTest.java:1060)
Collapse Failed JDFToXJDFConverterTest testCleanupFalse History
build MACOSX < 1 sec
java.lang.AssertionError
	at org.cip4.jdflib.extensions.xjdfwalker.JDFToXJDFConverterTest.testCleanupFalse(JDFToXJDFConverterTest.java:952)
Collapse Failed JDFToXJDFConverterTest testMediaInline History
build MACOSX < 1 sec
java.lang.AssertionError
	at org.cip4.jdflib.extensions.xjdfwalker.JDFToXJDFConverterTest.testMediaInline(JDFToXJDFConverterTest.java:1844)
Collapse Failed JDFToXJDFConverterTest testMediaComponentIn History
build MACOSX < 1 sec
java.lang.NullPointerException
	at org.cip4.jdflib.extensions.xjdfwalker.JDFToXJDFConverterTest.testMediaComponentIn(JDFToXJDFConverterTest.java:1767)
Collapse Failed JDFToXJDFConverterTest testColorPoolSpace History
build MACOSX < 1 sec
org.junit.ComparisonFailure: expected:<[Error]> but was:<[Valid]>
	at org.cip4.jdflib.extensions.xjdfwalker.JDFToXJDFConverterTest.testColorPoolSpace(JDFToXJDFConverterTest.java:1119)
Collapse Failed JDFToXJDFConverterTest testColorantControl History
build MACOSX < 1 sec
org.junit.ComparisonFailure: expected:<[Error]> but was:<[Valid]>
	at org.cip4.jdflib.extensions.xjdfwalker.JDFToXJDFConverterTest.testColorantControl(JDFToXJDFConverterTest.java:1026)
Collapse Failed JDFToXJDFConverterTest testLayoutMedia History
build MACOSX < 1 sec
java.lang.AssertionError
	at org.cip4.jdflib.extensions.xjdfwalker.JDFToXJDFConverterTest.testLayoutMedia(JDFToXJDFConverterTest.java:1992)
Collapse Failed JDFToXJDFConverterTest testRefMediaFromInline History
build MACOSX < 1 sec
org.junit.ComparisonFailure: expected:<[Error]> but was:<[Valid]>
	at org.cip4.jdflib.extensions.xjdfwalker.JDFToXJDFConverterTest.testRefMediaFromInline(JDFToXJDFConverterTest.java:215)
Collapse Failed JDFToXJDFConverterTest testColorantControlRefPool History
build MACOSX < 1 sec
org.junit.ComparisonFailure: expected:<[Error]> but was:<[Valid]>
	at org.cip4.jdflib.extensions.xjdfwalker.JDFToXJDFConverterTest.testColorantControlRefPool(JDFToXJDFConverterTest.java:1060)
Collapse Failed JDFToXJDFConverterTest testCleanupFalse History
build WINDOWS < 1 sec
java.lang.AssertionError
	at org.cip4.jdflib.extensions.xjdfwalker.JDFToXJDFConverterTest.testCleanupFalse(JDFToXJDFConverterTest.java:952)
Collapse Failed JDFToXJDFConverterTest testMediaInline History
build WINDOWS < 1 sec
java.lang.AssertionError
	at org.cip4.jdflib.extensions.xjdfwalker.JDFToXJDFConverterTest.testMediaInline(JDFToXJDFConverterTest.java:1844)
Collapse Failed JDFToXJDFConverterTest testMediaComponentIn History
build WINDOWS < 1 sec
java.lang.NullPointerException
	at org.cip4.jdflib.extensions.xjdfwalker.JDFToXJDFConverterTest.testMediaComponentIn(JDFToXJDFConverterTest.java:1767)
Collapse Failed JDFToXJDFConverterTest testColorPoolSpace History
build WINDOWS < 1 sec
org.junit.ComparisonFailure: expected:<[Error]> but was:<[Valid]>
	at org.cip4.jdflib.extensions.xjdfwalker.JDFToXJDFConverterTest.testColorPoolSpace(JDFToXJDFConverterTest.java:1119)
Collapse Failed JDFToXJDFConverterTest testColorantControl History
build WINDOWS < 1 sec
org.junit.ComparisonFailure: expected:<[Error]> but was:<[Valid]>
	at org.cip4.jdflib.extensions.xjdfwalker.JDFToXJDFConverterTest.testColorantControl(JDFToXJDFConverterTest.java:1026)
Collapse Failed JDFToXJDFConverterTest testLayoutMedia History
build WINDOWS < 1 sec
java.lang.AssertionError
	at org.cip4.jdflib.extensions.xjdfwalker.JDFToXJDFConverterTest.testLayoutMedia(JDFToXJDFConverterTest.java:1992)
Collapse Failed JDFToXJDFConverterTest testRefMediaFromInline History
build WINDOWS < 1 sec
org.junit.ComparisonFailure: expected:<[Error]> but was:<[Valid]>
	at org.cip4.jdflib.extensions.xjdfwalker.JDFToXJDFConverterTest.testRefMediaFromInline(JDFToXJDFConverterTest.java:215)
Collapse Failed JDFToXJDFConverterTest testColorantControlRefPool History
build WINDOWS < 1 sec
org.junit.ComparisonFailure: expected:<[Error]> but was:<[Valid]>
	at org.cip4.jdflib.extensions.xjdfwalker.JDFToXJDFConverterTest.testColorantControlRefPool(JDFToXJDFConverterTest.java:1060)
Collapse Failed MultiXJDFCombinerTest testSammelDrop History
build LINUX < 1 sec
java.lang.AssertionError
	at org.cip4.jdflib.extensions.xjdfwalker.jdftoxjdf.MultiXJDFCombinerTest.testSammelDrop(MultiXJDFCombinerTest.java:155)
Collapse Failed MultiXJDFCombinerTest testSammelDrop History
build MACOSX < 1 sec
java.lang.AssertionError
	at org.cip4.jdflib.extensions.xjdfwalker.jdftoxjdf.MultiXJDFCombinerTest.testSammelDrop(MultiXJDFCombinerTest.java:155)
Collapse Failed MultiXJDFCombinerTest testSammelDrop History
build WINDOWS < 1 sec
java.lang.AssertionError
	at org.cip4.jdflib.extensions.xjdfwalker.jdftoxjdf.MultiXJDFCombinerTest.testSammelDrop(MultiXJDFCombinerTest.java:155)
Collapse Failed MISCPGoldenTicketTest testMISCPProductBrochure History
build LINUX < 1 sec
org.junit.ComparisonFailure: /home/cip4secretariat/bamboo/agent-1/xml-data/build-dir/LIB-JDFLIBJ-LINUX/target/test-classes/data/temp/GoldenTicket_Manager_MISCPS_ProductFlyer.schema.xml expected:<[Valid]> but was:<[Error]>
	at org.cip4.jdflib.goldenticket.MISCPGoldenTicketTest.testMISCPProductBrochure(MISCPGoldenTicketTest.java:290)
Collapse Failed MISCPGoldenTicketTest testMISCPGrayBoxFrontBack History
build LINUX < 1 sec
org.junit.ComparisonFailure: /home/cip4secretariat/bamboo/agent-1/xml-data/build-dir/LIB-JDFLIBJ-LINUX/target/test-classes/data/temp/GoldenTicket_Manager_MISCPS_1_GB.schema.xml expected:<[Valid]> but was:<[Error]>
	at org.cip4.jdflib.goldenticket.MISCPGoldenTicketTest.testMISCPGrayBoxFrontBack(MISCPGoldenTicketTest.java:120)
Collapse Failed MISCPGoldenTicketTest testIdenticalInk History
build LINUX 1 sec
org.junit.ComparisonFailure: /home/cip4secretariat/bamboo/agent-1/xml-data/build-dir/LIB-JDFLIBJ-LINUX/target/test-classes/data/temp/GoldenTicket_Manager_sameInk.schema.xml expected:<[Valid]> but was:<[Error]>
	at org.cip4.jdflib.goldenticket.MISCPGoldenTicketTest.testIdenticalInk(MISCPGoldenTicketTest.java:334)
Collapse Failed MISCPGoldenTicketTest testMISCPGrayBoxSimplexPoster History
build LINUX < 1 sec
org.junit.ComparisonFailure: /home/cip4secretariat/bamboo/agent-1/xml-data/build-dir/LIB-JDFLIBJ-LINUX/target/test-classes/data/temp/GoldenTicket_Manager_MISCPS_SimplexPoster.schema.xml expected:<[Valid]> but was:<[Error]>
	at org.cip4.jdflib.goldenticket.MISCPGoldenTicketTest.testMISCPGrayBoxSimplexPoster(MISCPGoldenTicketTest.java:182)
Collapse Failed MISCPGoldenTicketTest testMISCPProductGrayBoxBrochure History
build LINUX < 1 sec
org.junit.ComparisonFailure: /home/cip4secretariat/bamboo/agent-1/xml-data/build-dir/LIB-JDFLIBJ-LINUX/target/test-classes/data/temp/GoldenTicket_Manager_MISCPS_ProductGrayBox.schema.xml expected:<[Valid]> but was:<[Error]>
	at org.cip4.jdflib.goldenticket.MISCPGoldenTicketTest.testMISCPProductGrayBoxBrochure(MISCPGoldenTicketTest.java:254)
Collapse Failed MISCPGoldenTicketTest testMISCPGrayBox41Poster History
build LINUX < 1 sec
org.junit.ComparisonFailure: /home/cip4secretariat/bamboo/agent-1/xml-data/build-dir/LIB-JDFLIBJ-LINUX/target/test-classes/data/temp/GoldenTicket_Manager_MISCPS_4_1Poster.schema.xml expected:<[Valid]> but was:<[Error]>
	at org.cip4.jdflib.goldenticket.MISCPGoldenTicketTest.testMISCPGrayBox41Poster(MISCPGoldenTicketTest.java:217)
Collapse Failed MISCPGoldenTicketTest testMISCPProductBrochure History
build MACOSX < 1 sec
org.junit.ComparisonFailure: /Users/cip4secretariat/Bamboo/bamboo-agent-1/xml-data/build-dir/LIB-JDFLIBJ-MACOSX/target/test-classes/data/temp/GoldenTicket_Manager_MISCPS_ProductFlyer.schema.xml expected:<[Valid]> but was:<[Error]>
	at org.cip4.jdflib.goldenticket.MISCPGoldenTicketTest.testMISCPProductBrochure(MISCPGoldenTicketTest.java:290)
Collapse Failed MISCPGoldenTicketTest testMISCPGrayBoxFrontBack History
build MACOSX < 1 sec
org.junit.ComparisonFailure: /Users/cip4secretariat/Bamboo/bamboo-agent-1/xml-data/build-dir/LIB-JDFLIBJ-MACOSX/target/test-classes/data/temp/GoldenTicket_Manager_MISCPS_1_GB.schema.xml expected:<[Valid]> but was:<[Error]>
	at org.cip4.jdflib.goldenticket.MISCPGoldenTicketTest.testMISCPGrayBoxFrontBack(MISCPGoldenTicketTest.java:120)
Collapse Failed MISCPGoldenTicketTest testIdenticalInk History
build MACOSX < 1 sec
org.junit.ComparisonFailure: /Users/cip4secretariat/Bamboo/bamboo-agent-1/xml-data/build-dir/LIB-JDFLIBJ-MACOSX/target/test-classes/data/temp/GoldenTicket_Manager_sameInk.schema.xml expected:<[Valid]> but was:<[Error]>
	at org.cip4.jdflib.goldenticket.MISCPGoldenTicketTest.testIdenticalInk(MISCPGoldenTicketTest.java:334)
Collapse Failed MISCPGoldenTicketTest testMISCPGrayBoxSimplexPoster History
build MACOSX < 1 sec
org.junit.ComparisonFailure: /Users/cip4secretariat/Bamboo/bamboo-agent-1/xml-data/build-dir/LIB-JDFLIBJ-MACOSX/target/test-classes/data/temp/GoldenTicket_Manager_MISCPS_SimplexPoster.schema.xml expected:<[Valid]> but was:<[Error]>
	at org.cip4.jdflib.goldenticket.MISCPGoldenTicketTest.testMISCPGrayBoxSimplexPoster(MISCPGoldenTicketTest.java:182)
Collapse Failed MISCPGoldenTicketTest testMISCPProductGrayBoxBrochure History
build MACOSX < 1 sec
org.junit.ComparisonFailure: /Users/cip4secretariat/Bamboo/bamboo-agent-1/xml-data/build-dir/LIB-JDFLIBJ-MACOSX/target/test-classes/data/temp/GoldenTicket_Manager_MISCPS_ProductGrayBox.schema.xml expected:<[Valid]> but was:<[Error]>
	at org.cip4.jdflib.goldenticket.MISCPGoldenTicketTest.testMISCPProductGrayBoxBrochure(MISCPGoldenTicketTest.java:254)
Collapse Failed MISCPGoldenTicketTest testMISCPGrayBox41Poster History
build MACOSX < 1 sec
org.junit.ComparisonFailure: /Users/cip4secretariat/Bamboo/bamboo-agent-1/xml-data/build-dir/LIB-JDFLIBJ-MACOSX/target/test-classes/data/temp/GoldenTicket_Manager_MISCPS_4_1Poster.schema.xml expected:<[Valid]> but was:<[Error]>
	at org.cip4.jdflib.goldenticket.MISCPGoldenTicketTest.testMISCPGrayBox41Poster(MISCPGoldenTicketTest.java:217)
Collapse Failed MISCPGoldenTicketTest testMISCPProductBrochure History
build WINDOWS 1 sec
org.junit.ComparisonFailure: \D:\bamboo\agent-2\xml-data\build-dir\LIB-JDFLIBJ-WINDOWS\target\test-classes\data\temp\GoldenTicket_Manager_MISCPS_ProductFlyer.schema.xml expected:<[Valid]> but was:<[Error]>
	at org.cip4.jdflib.goldenticket.MISCPGoldenTicketTest.testMISCPProductBrochure(MISCPGoldenTicketTest.java:290)
Collapse Failed MISCPGoldenTicketTest testMISCPGrayBoxFrontBack History
build WINDOWS < 1 sec
org.junit.ComparisonFailure: \D:\bamboo\agent-2\xml-data\build-dir\LIB-JDFLIBJ-WINDOWS\target\test-classes\data\temp\GoldenTicket_Manager_MISCPS_1_GB.schema.xml expected:<[Valid]> but was:<[Error]>
	at org.cip4.jdflib.goldenticket.MISCPGoldenTicketTest.testMISCPGrayBoxFrontBack(MISCPGoldenTicketTest.java:120)
Collapse Failed MISCPGoldenTicketTest testIdenticalInk History
build WINDOWS 1 sec
org.junit.ComparisonFailure: \D:\bamboo\agent-2\xml-data\build-dir\LIB-JDFLIBJ-WINDOWS\target\test-classes\data\temp\GoldenTicket_Manager_sameInk.schema.xml expected:<[Valid]> but was:<[Error]>
	at org.cip4.jdflib.goldenticket.MISCPGoldenTicketTest.testIdenticalInk(MISCPGoldenTicketTest.java:334)
Collapse Failed MISCPGoldenTicketTest testMISCPGrayBoxSimplexPoster History
build WINDOWS < 1 sec
org.junit.ComparisonFailure: \D:\bamboo\agent-2\xml-data\build-dir\LIB-JDFLIBJ-WINDOWS\target\test-classes\data\temp\GoldenTicket_Manager_MISCPS_SimplexPoster.schema.xml expected:<[Valid]> but was:<[Error]>
	at org.cip4.jdflib.goldenticket.MISCPGoldenTicketTest.testMISCPGrayBoxSimplexPoster(MISCPGoldenTicketTest.java:182)
Collapse Failed MISCPGoldenTicketTest testMISCPProductGrayBoxBrochure History
build WINDOWS < 1 sec
org.junit.ComparisonFailure: \D:\bamboo\agent-2\xml-data\build-dir\LIB-JDFLIBJ-WINDOWS\target\test-classes\data\temp\GoldenTicket_Manager_MISCPS_ProductGrayBox.schema.xml expected:<[Valid]> but was:<[Error]>
	at org.cip4.jdflib.goldenticket.MISCPGoldenTicketTest.testMISCPProductGrayBoxBrochure(MISCPGoldenTicketTest.java:254)
Collapse Failed MISCPGoldenTicketTest testMISCPGrayBox41Poster History
build WINDOWS < 1 sec
org.junit.ComparisonFailure: \D:\bamboo\agent-2\xml-data\build-dir\LIB-JDFLIBJ-WINDOWS\target\test-classes\data\temp\GoldenTicket_Manager_MISCPS_4_1Poster.schema.xml expected:<[Valid]> but was:<[Error]>
	at org.cip4.jdflib.goldenticket.MISCPGoldenTicketTest.testMISCPGrayBox41Poster(MISCPGoldenTicketTest.java:217)
Skipped tests 18
Status Test Failing since View job
Skipped TestJDF testSpawnedResources History
build LINUX
Skipped TestJDF testCheckSpawnedResources History
build LINUX
Skipped TestJDF fixExampleVersions History
build LINUX
Skipped TestJDF testSpawnedResources History
build MACOSX
Skipped TestJDF testCheckSpawnedResources History
build MACOSX
Skipped TestJDF fixExampleVersions History
build MACOSX
Skipped TestJDF testSpawnedResources History
build WINDOWS
Skipped TestJDF testCheckSpawnedResources History
build WINDOWS
Skipped TestJDF fixExampleVersions History
build WINDOWS
Skipped StrippingTest testCommonFolds History
build LINUX
Skipped StrippingTest testCommonFolds History
build MACOSX
Skipped StrippingTest testCommonFolds History
build WINDOWS
Skipped MultiXJDFCombinerTest testSammel19 History
build LINUX
Skipped MultiXJDFCombinerTest testSammel19 History
build MACOSX
Skipped MultiXJDFCombinerTest testSammel19 History
build WINDOWS
Skipped OrderedTaskQueueTest testInterruptTask History
build LINUX
Skipped OrderedTaskQueueTest testInterruptTask History
build MACOSX
Skipped OrderedTaskQueueTest testInterruptTask History
build WINDOWS