Stages & jobs

  1. Default Stage

Build result summary

Details

Completed
Duration
42 minutes
Labels
None
Revision
d300160ad107306d36f2a2a29314f5cf2e73018d d300160ad107306d36f2a2a29314f5cf2e73018d
Total tests
6850
Failing since
#1327 (Changes by Rainer Prosi <rainer.prosi@heidelberg.com>)
Fixed in
#1331 (Rebuilt by Rainer Prosi)

Responsible

This build has been failing since #1327
No one has taken responsibility

Code commits

Author Commit Message Commit date
Rainer Prosi <rainer.prosi@heidelberg.com> Rainer Prosi <rainer.prosi@heidelberg.com> d300160ad107306d36f2a2a29314f5cf2e73018d d300160ad107306d36f2a2a29314f5cf2e73018d test fix

Tests

New test failures 1
Status Test View job Duration
Collapse Failed OrderedTaskQueueTest testStop History
build MACOSX < 1 sec
java.lang.AssertionError
	at org.cip4.jdflib.util.thread.OrderedTaskQueueTest.testStop(OrderedTaskQueueTest.java:174)
Existing test failures 4
Status Test Failing since View job Duration
java.lang.AssertionError
	at org.cip4.jdflib.extensions.XJDFTest.testDependencies(XJDFTest.java:909)
java.lang.AssertionError
	at org.cip4.jdflib.extensions.XJDFTest.testDependencies(XJDFTest.java:909)
java.lang.AssertionError
	at org.cip4.jdflib.extensions.xjdfwalker.JDFToXJDFConverterTest.testCleanupFalse(JDFToXJDFConverterTest.java:952)
java.lang.AssertionError
	at org.cip4.jdflib.extensions.xjdfwalker.JDFToXJDFConverterTest.testCleanupFalse(JDFToXJDFConverterTest.java:952)
Fixed tests 34
Status Test Failing since View job Duration
Successful VarnishTest testCombinedVarnish History
Failing since build #1327 (Changes by Rainer Prosi <rainer.prosi@heidelberg.com>) build LINUX 1 sec
Successful VarnishTest testCombinedVarnish History
Failing since build #1327 (Changes by Rainer Prosi <rainer.prosi@heidelberg.com>) build MACOSX 1 sec
Successful XJDFTest testFromXJDFMedia History
Failing since build #1327 (Changes by Rainer Prosi <rainer.prosi@heidelberg.com>) build LINUX < 1 sec
Successful XJDFTest testFromXJDFMedia History
Failing since build #1327 (Changes by Rainer Prosi <rainer.prosi@heidelberg.com>) build MACOSX < 1 sec
Successful XJDFAdditionalExampleTest testSeparationSplit History
Failing since build #1327 (Changes by Rainer Prosi <rainer.prosi@heidelberg.com>) build LINUX < 1 sec
Successful XJDFAdditionalExampleTest testSeparationSplit History
Failing since build #1327 (Changes by Rainer Prosi <rainer.prosi@heidelberg.com>) build MACOSX < 1 sec
Successful JDFToXJDFConverterTest testColorantControl History
Failing since build #1327 (Changes by Rainer Prosi <rainer.prosi@heidelberg.com>) build LINUX < 1 sec
Successful JDFToXJDFConverterTest testColorPoolSpace History
Failing since build #1327 (Changes by Rainer Prosi <rainer.prosi@heidelberg.com>) build LINUX < 1 sec
Successful JDFToXJDFConverterTest testLayoutMedia History
Failing since build #1327 (Changes by Rainer Prosi <rainer.prosi@heidelberg.com>) build LINUX < 1 sec
Successful JDFToXJDFConverterTest testMediaInline History
Failing since build #1327 (Changes by Rainer Prosi <rainer.prosi@heidelberg.com>) build LINUX < 1 sec
Successful JDFToXJDFConverterTest testRefMediaFromInline History
Failing since build #1327 (Changes by Rainer Prosi <rainer.prosi@heidelberg.com>) build LINUX < 1 sec
Successful JDFToXJDFConverterTest testMediaComponentIn History
Failing since build #1327 (Changes by Rainer Prosi <rainer.prosi@heidelberg.com>) build LINUX < 1 sec
Successful JDFToXJDFConverterTest testColorantControlRefPool History
Failing since build #1327 (Changes by Rainer Prosi <rainer.prosi@heidelberg.com>) build LINUX < 1 sec
Successful JDFToXJDFConverterTest testColorantControl History
Failing since build #1327 (Changes by Rainer Prosi <rainer.prosi@heidelberg.com>) build MACOSX < 1 sec
Successful JDFToXJDFConverterTest testColorPoolSpace History
Failing since build #1327 (Changes by Rainer Prosi <rainer.prosi@heidelberg.com>) build MACOSX < 1 sec
Successful JDFToXJDFConverterTest testLayoutMedia History
Failing since build #1327 (Changes by Rainer Prosi <rainer.prosi@heidelberg.com>) build MACOSX < 1 sec
Successful JDFToXJDFConverterTest testMediaInline History
Failing since build #1327 (Changes by Rainer Prosi <rainer.prosi@heidelberg.com>) build MACOSX < 1 sec
Successful JDFToXJDFConverterTest testRefMediaFromInline History
Failing since build #1327 (Changes by Rainer Prosi <rainer.prosi@heidelberg.com>) build MACOSX < 1 sec
Successful JDFToXJDFConverterTest testMediaComponentIn History
Failing since build #1327 (Changes by Rainer Prosi <rainer.prosi@heidelberg.com>) build MACOSX < 1 sec
Successful JDFToXJDFConverterTest testColorantControlRefPool History
Failing since build #1327 (Changes by Rainer Prosi <rainer.prosi@heidelberg.com>) build MACOSX < 1 sec
Successful MultiXJDFCombinerTest testSammelDrop History
Failing since build #1327 (Changes by Rainer Prosi <rainer.prosi@heidelberg.com>) build LINUX < 1 sec
Successful MultiXJDFCombinerTest testSammelDrop History
Failing since build #1327 (Changes by Rainer Prosi <rainer.prosi@heidelberg.com>) build MACOSX < 1 sec
Successful MISCPGoldenTicketTest testIdenticalInk History
Failing since build #1327 (Changes by Rainer Prosi <rainer.prosi@heidelberg.com>) build LINUX 1 sec
Successful MISCPGoldenTicketTest testMISCPGrayBox41Poster History
Failing since build #1327 (Changes by Rainer Prosi <rainer.prosi@heidelberg.com>) build LINUX < 1 sec
Successful MISCPGoldenTicketTest testMISCPProductBrochure History
Failing since build #1327 (Changes by Rainer Prosi <rainer.prosi@heidelberg.com>) build LINUX 1 sec
Successful MISCPGoldenTicketTest testMISCPGrayBoxFrontBack History
Failing since build #1327 (Changes by Rainer Prosi <rainer.prosi@heidelberg.com>) build LINUX < 1 sec
Successful MISCPGoldenTicketTest testMISCPProductGrayBoxBrochure History
Failing since build #1327 (Changes by Rainer Prosi <rainer.prosi@heidelberg.com>) build LINUX < 1 sec
Successful MISCPGoldenTicketTest testMISCPGrayBoxSimplexPoster History
Failing since build #1327 (Changes by Rainer Prosi <rainer.prosi@heidelberg.com>) build LINUX < 1 sec
Successful MISCPGoldenTicketTest testMISCPGrayBoxFrontBack History
Failing since build #1327 (Changes by Rainer Prosi <rainer.prosi@heidelberg.com>) build MACOSX < 1 sec
Successful MISCPGoldenTicketTest testMISCPProductGrayBoxBrochure History
Failing since build #1327 (Changes by Rainer Prosi <rainer.prosi@heidelberg.com>) build MACOSX < 1 sec
Successful MISCPGoldenTicketTest testMISCPGrayBoxSimplexPoster History
Failing since build #1327 (Changes by Rainer Prosi <rainer.prosi@heidelberg.com>) build MACOSX < 1 sec
Successful MISCPGoldenTicketTest testIdenticalInk History
Failing since build #1327 (Changes by Rainer Prosi <rainer.prosi@heidelberg.com>) build MACOSX 1 sec
Successful MISCPGoldenTicketTest testMISCPGrayBox41Poster History
Failing since build #1327 (Changes by Rainer Prosi <rainer.prosi@heidelberg.com>) build MACOSX < 1 sec
Successful MISCPGoldenTicketTest testMISCPProductBrochure History
Failing since build #1327 (Changes by Rainer Prosi <rainer.prosi@heidelberg.com>) build MACOSX < 1 sec

Shared artifacts

Artifact File size
doc 0 bytes
src 0 bytes
jar 0 bytes
samples 136 KB

Error log

    Agent 'Windows Agent #2' went offline while building LIB-JDFLIBJ-WINDOWS-1328. The results of that build will not be available.

    (18 Aug 2019, 6:25:01 PM)