Stages & jobs

  1. Default Stage

Test results

  • 6.850 tests in total
  • 5 tests failed
  • 1 failure is new
  • 34 tests were fixed
  • 12 tests were quarantined / skipped
  • 17 minutes taken in total.
New test failures 1
Status Test View job Duration
Collapse Failed OrderedTaskQueueTest testStop History
build MACOSX < 1 sec
java.lang.AssertionError
	at org.cip4.jdflib.util.thread.OrderedTaskQueueTest.testStop(OrderedTaskQueueTest.java:174)
Existing test failures 4
Status Test Failing since View job Duration
java.lang.AssertionError
	at org.cip4.jdflib.extensions.XJDFTest.testDependencies(XJDFTest.java:909)
java.lang.AssertionError
	at org.cip4.jdflib.extensions.XJDFTest.testDependencies(XJDFTest.java:909)
java.lang.AssertionError
	at org.cip4.jdflib.extensions.xjdfwalker.JDFToXJDFConverterTest.testCleanupFalse(JDFToXJDFConverterTest.java:952)
java.lang.AssertionError
	at org.cip4.jdflib.extensions.xjdfwalker.JDFToXJDFConverterTest.testCleanupFalse(JDFToXJDFConverterTest.java:952)
Fixed tests 34
Status Test Failing since View job Duration
Successful VarnishTest testCombinedVarnish History
Failing since build #1327 (Changes by Rainer Prosi <rainer.prosi@heidelberg.com>) build LINUX 1 sec
Successful VarnishTest testCombinedVarnish History
Failing since build #1327 (Changes by Rainer Prosi <rainer.prosi@heidelberg.com>) build MACOSX 1 sec
Successful XJDFTest testFromXJDFMedia History
Failing since build #1327 (Changes by Rainer Prosi <rainer.prosi@heidelberg.com>) build LINUX < 1 sec
Successful XJDFTest testFromXJDFMedia History
Failing since build #1327 (Changes by Rainer Prosi <rainer.prosi@heidelberg.com>) build MACOSX < 1 sec
Successful XJDFAdditionalExampleTest testSeparationSplit History
Failing since build #1327 (Changes by Rainer Prosi <rainer.prosi@heidelberg.com>) build LINUX < 1 sec
Successful XJDFAdditionalExampleTest testSeparationSplit History
Failing since build #1327 (Changes by Rainer Prosi <rainer.prosi@heidelberg.com>) build MACOSX < 1 sec
Successful JDFToXJDFConverterTest testColorantControl History
Failing since build #1327 (Changes by Rainer Prosi <rainer.prosi@heidelberg.com>) build LINUX < 1 sec
Successful JDFToXJDFConverterTest testColorPoolSpace History
Failing since build #1327 (Changes by Rainer Prosi <rainer.prosi@heidelberg.com>) build LINUX < 1 sec
Successful JDFToXJDFConverterTest testLayoutMedia History
Failing since build #1327 (Changes by Rainer Prosi <rainer.prosi@heidelberg.com>) build LINUX < 1 sec
Successful JDFToXJDFConverterTest testMediaInline History
Failing since build #1327 (Changes by Rainer Prosi <rainer.prosi@heidelberg.com>) build LINUX < 1 sec
Successful JDFToXJDFConverterTest testRefMediaFromInline History
Failing since build #1327 (Changes by Rainer Prosi <rainer.prosi@heidelberg.com>) build LINUX < 1 sec
Successful JDFToXJDFConverterTest testMediaComponentIn History
Failing since build #1327 (Changes by Rainer Prosi <rainer.prosi@heidelberg.com>) build LINUX < 1 sec
Successful JDFToXJDFConverterTest testColorantControlRefPool History
Failing since build #1327 (Changes by Rainer Prosi <rainer.prosi@heidelberg.com>) build LINUX < 1 sec
Successful JDFToXJDFConverterTest testLayoutMedia History
Failing since build #1327 (Changes by Rainer Prosi <rainer.prosi@heidelberg.com>) build MACOSX < 1 sec
Successful JDFToXJDFConverterTest testMediaInline History
Failing since build #1327 (Changes by Rainer Prosi <rainer.prosi@heidelberg.com>) build MACOSX < 1 sec
Successful JDFToXJDFConverterTest testRefMediaFromInline History
Failing since build #1327 (Changes by Rainer Prosi <rainer.prosi@heidelberg.com>) build MACOSX < 1 sec
Successful JDFToXJDFConverterTest testMediaComponentIn History
Failing since build #1327 (Changes by Rainer Prosi <rainer.prosi@heidelberg.com>) build MACOSX < 1 sec
Successful JDFToXJDFConverterTest testColorantControlRefPool History
Failing since build #1327 (Changes by Rainer Prosi <rainer.prosi@heidelberg.com>) build MACOSX < 1 sec
Successful JDFToXJDFConverterTest testColorantControl History
Failing since build #1327 (Changes by Rainer Prosi <rainer.prosi@heidelberg.com>) build MACOSX < 1 sec
Successful JDFToXJDFConverterTest testColorPoolSpace History
Failing since build #1327 (Changes by Rainer Prosi <rainer.prosi@heidelberg.com>) build MACOSX < 1 sec
Successful MultiXJDFCombinerTest testSammelDrop History
Failing since build #1327 (Changes by Rainer Prosi <rainer.prosi@heidelberg.com>) build LINUX < 1 sec
Successful MultiXJDFCombinerTest testSammelDrop History
Failing since build #1327 (Changes by Rainer Prosi <rainer.prosi@heidelberg.com>) build MACOSX < 1 sec
Successful MISCPGoldenTicketTest testIdenticalInk History
Failing since build #1327 (Changes by Rainer Prosi <rainer.prosi@heidelberg.com>) build LINUX 1 sec
Successful MISCPGoldenTicketTest testMISCPGrayBox41Poster History
Failing since build #1327 (Changes by Rainer Prosi <rainer.prosi@heidelberg.com>) build LINUX < 1 sec
Successful MISCPGoldenTicketTest testMISCPProductBrochure History
Failing since build #1327 (Changes by Rainer Prosi <rainer.prosi@heidelberg.com>) build LINUX 1 sec
Successful MISCPGoldenTicketTest testMISCPGrayBoxFrontBack History
Failing since build #1327 (Changes by Rainer Prosi <rainer.prosi@heidelberg.com>) build LINUX < 1 sec
Successful MISCPGoldenTicketTest testMISCPProductGrayBoxBrochure History
Failing since build #1327 (Changes by Rainer Prosi <rainer.prosi@heidelberg.com>) build LINUX < 1 sec
Successful MISCPGoldenTicketTest testMISCPGrayBoxSimplexPoster History
Failing since build #1327 (Changes by Rainer Prosi <rainer.prosi@heidelberg.com>) build LINUX < 1 sec
Successful MISCPGoldenTicketTest testMISCPGrayBoxFrontBack History
Failing since build #1327 (Changes by Rainer Prosi <rainer.prosi@heidelberg.com>) build MACOSX < 1 sec
Successful MISCPGoldenTicketTest testMISCPProductGrayBoxBrochure History
Failing since build #1327 (Changes by Rainer Prosi <rainer.prosi@heidelberg.com>) build MACOSX < 1 sec
Successful MISCPGoldenTicketTest testMISCPGrayBoxSimplexPoster History
Failing since build #1327 (Changes by Rainer Prosi <rainer.prosi@heidelberg.com>) build MACOSX < 1 sec
Successful MISCPGoldenTicketTest testIdenticalInk History
Failing since build #1327 (Changes by Rainer Prosi <rainer.prosi@heidelberg.com>) build MACOSX 1 sec
Successful MISCPGoldenTicketTest testMISCPGrayBox41Poster History
Failing since build #1327 (Changes by Rainer Prosi <rainer.prosi@heidelberg.com>) build MACOSX < 1 sec
Successful MISCPGoldenTicketTest testMISCPProductBrochure History
Failing since build #1327 (Changes by Rainer Prosi <rainer.prosi@heidelberg.com>) build MACOSX < 1 sec
Skipped tests 12
Status Test Failing since View job
Skipped TestJDF testSpawnedResources History
build LINUX
Skipped TestJDF testCheckSpawnedResources History
build LINUX
Skipped TestJDF fixExampleVersions History
build LINUX
Skipped TestJDF testSpawnedResources History
build MACOSX
Skipped TestJDF testCheckSpawnedResources History
build MACOSX
Skipped TestJDF fixExampleVersions History
build MACOSX
Skipped StrippingTest testCommonFolds History
build LINUX
Skipped StrippingTest testCommonFolds History
build MACOSX
Skipped MultiXJDFCombinerTest testSammel19 History
build LINUX
Skipped MultiXJDFCombinerTest testSammel19 History
build MACOSX
Skipped OrderedTaskQueueTest testInterruptTask History
build LINUX
Skipped OrderedTaskQueueTest testInterruptTask History
build MACOSX