Stages & jobs

  1. Default Stage

Build result summary

Details

Completed
Duration
139 minutes
Labels
None
Revision
60bc147cf48448b2bc7bb635e346d8371c397dae 60bc147cf48448b2bc7bb635e346d8371c397dae
Total tests
5463
Failing since
#1327 (Changes by Rainer Prosi <rainer.prosi@heidelberg.com>)
Fixed in
#1331 (Rebuilt by Rainer Prosi)

Responsible

This build has been failing since #1327
No one has taken responsibility

Code commits

Author Commit Message Commit date
Rainer Prosi <rainer.prosi@heidelberg.com> Rainer Prosi <rainer.prosi@heidelberg.com> 60bc147cf48448b2bc7bb635e346d8371c397dae 60bc147cf48448b2bc7bb635e346d8371c397dae speedup (Vector -> list)

Tests

New test failures 8
Status Test View job Duration
Collapse Failed JDFQueueEntryTest testSetPriority History
build LINUX < 1 sec
java.lang.IndexOutOfBoundsException: Index: 1, Size: 1
	at org.cip4.jdflib.jmf.JDFQueueEntryTest.testSetPriority(JDFQueueEntryTest.java:175)
Collapse Failed JDFQueueEntryTest testSetQueueEntryStatus History
build LINUX < 1 sec
java.lang.IndexOutOfBoundsException: Index: 4, Size: 4
	at org.cip4.jdflib.jmf.JDFQueueEntryTest.testSetQueueEntryStatus(JDFQueueEntryTest.java:220)
Collapse Failed JDFQueueEntryTest testSetPriority History
build MACOSX < 1 sec
java.lang.IndexOutOfBoundsException: Index: 1, Size: 1
	at org.cip4.jdflib.jmf.JDFQueueEntryTest.testSetPriority(JDFQueueEntryTest.java:175)
Collapse Failed JDFQueueEntryTest testSetQueueEntryStatus History
build MACOSX < 1 sec
java.lang.IndexOutOfBoundsException: Index: 4, Size: 4
	at org.cip4.jdflib.jmf.JDFQueueEntryTest.testSetQueueEntryStatus(JDFQueueEntryTest.java:220)
Collapse Failed QueueTest testOpenClose History
build LINUX < 1 sec
java.lang.IndexOutOfBoundsException: Index: 1, Size: 1
	at org.cip4.jdflib.jmf.QueueTest.testOpenClose(QueueTest.java:202)
Collapse Failed QueueTest testCreateQueueEntry History
build LINUX < 1 sec
java.lang.IndexOutOfBoundsException: Index: 1, Size: 1
	at org.cip4.jdflib.jmf.QueueTest.testCreateQueueEntry(QueueTest.java:166)
Collapse Failed QueueTest testThreads History
build LINUX < 1 sec
java.lang.IndexOutOfBoundsException: Index: 100, Size: 100
	at org.cip4.jdflib.jmf.QueueTest.testThreads(QueueTest.java:375)
Collapse Failed QueueTest testSortCompleted History
build LINUX < 1 sec
java.lang.IndexOutOfBoundsException: Index: 1, Size: 1
	at org.cip4.jdflib.jmf.QueueTest.testSortCompleted(QueueTest.java:344)
Existing test failures 4
Status Test Failing since View job Duration
java.lang.AssertionError
	at org.cip4.jdflib.extensions.XJDFTest.testDependencies(XJDFTest.java:909)
java.lang.AssertionError
	at org.cip4.jdflib.extensions.XJDFTest.testDependencies(XJDFTest.java:909)
java.lang.AssertionError
	at org.cip4.jdflib.extensions.xjdfwalker.JDFToXJDFConverterTest.testCleanupFalse(JDFToXJDFConverterTest.java:952)
java.lang.AssertionError
	at org.cip4.jdflib.extensions.xjdfwalker.JDFToXJDFConverterTest.testCleanupFalse(JDFToXJDFConverterTest.java:952)

Shared artifacts

Artifact File size
doc 0 bytes
src 0 bytes
jar 0 bytes
samples 136 KB

Error log

    Agent 'Windows Agent #1' went offline while building LIB-JDFLIBJ-WINDOWS-1329. The results of that build will not be available.

    (18 Aug 2019, 6:19:35 PM)