Stages & jobs

  1. Default Stage

Test results

  • 5.463 tests in total
  • 12 tests failed
  • 8 failures are new
  • 11 tests were quarantined / skipped
  • 12 minutes taken in total.
New test failures 8
Status Test View job Duration
Collapse Failed JDFQueueEntryTest testSetPriority History
build LINUX < 1 sec
java.lang.IndexOutOfBoundsException: Index: 1, Size: 1
	at org.cip4.jdflib.jmf.JDFQueueEntryTest.testSetPriority(JDFQueueEntryTest.java:175)
Collapse Failed JDFQueueEntryTest testSetQueueEntryStatus History
build LINUX < 1 sec
java.lang.IndexOutOfBoundsException: Index: 4, Size: 4
	at org.cip4.jdflib.jmf.JDFQueueEntryTest.testSetQueueEntryStatus(JDFQueueEntryTest.java:220)
Collapse Failed JDFQueueEntryTest testSetPriority History
build MACOSX < 1 sec
java.lang.IndexOutOfBoundsException: Index: 1, Size: 1
	at org.cip4.jdflib.jmf.JDFQueueEntryTest.testSetPriority(JDFQueueEntryTest.java:175)
Collapse Failed JDFQueueEntryTest testSetQueueEntryStatus History
build MACOSX < 1 sec
java.lang.IndexOutOfBoundsException: Index: 4, Size: 4
	at org.cip4.jdflib.jmf.JDFQueueEntryTest.testSetQueueEntryStatus(JDFQueueEntryTest.java:220)
Collapse Failed QueueTest testOpenClose History
build LINUX < 1 sec
java.lang.IndexOutOfBoundsException: Index: 1, Size: 1
	at org.cip4.jdflib.jmf.QueueTest.testOpenClose(QueueTest.java:202)
Collapse Failed QueueTest testCreateQueueEntry History
build LINUX < 1 sec
java.lang.IndexOutOfBoundsException: Index: 1, Size: 1
	at org.cip4.jdflib.jmf.QueueTest.testCreateQueueEntry(QueueTest.java:166)
Collapse Failed QueueTest testThreads History
build LINUX < 1 sec
java.lang.IndexOutOfBoundsException: Index: 100, Size: 100
	at org.cip4.jdflib.jmf.QueueTest.testThreads(QueueTest.java:375)
Collapse Failed QueueTest testSortCompleted History
build LINUX < 1 sec
java.lang.IndexOutOfBoundsException: Index: 1, Size: 1
	at org.cip4.jdflib.jmf.QueueTest.testSortCompleted(QueueTest.java:344)
Existing test failures 4
Status Test Failing since View job Duration
java.lang.AssertionError
	at org.cip4.jdflib.extensions.XJDFTest.testDependencies(XJDFTest.java:909)
java.lang.AssertionError
	at org.cip4.jdflib.extensions.XJDFTest.testDependencies(XJDFTest.java:909)
java.lang.AssertionError
	at org.cip4.jdflib.extensions.xjdfwalker.JDFToXJDFConverterTest.testCleanupFalse(JDFToXJDFConverterTest.java:952)
java.lang.AssertionError
	at org.cip4.jdflib.extensions.xjdfwalker.JDFToXJDFConverterTest.testCleanupFalse(JDFToXJDFConverterTest.java:952)
Skipped tests 11
Status Test Failing since View job
Skipped TestJDF testSpawnedResources History
build LINUX
Skipped TestJDF testCheckSpawnedResources History
build LINUX
Skipped TestJDF fixExampleVersions History
build LINUX
Skipped TestJDF testSpawnedResources History
build MACOSX
Skipped TestJDF testCheckSpawnedResources History
build MACOSX
Skipped TestJDF fixExampleVersions History
build MACOSX
Skipped StrippingTest testCommonFolds History
build LINUX
Skipped StrippingTest testCommonFolds History
build MACOSX
Skipped MultiXJDFCombinerTest testSammel19 History
build LINUX
Skipped MultiXJDFCombinerTest testSammel19 History
build MACOSX
Skipped OrderedTaskQueueTest testInterruptTask History
build LINUX