Stages & jobs

  1. Default Stage

Build result summary

Details

Completed
Duration
895 minutes
Labels
None
Revision
3b727a5673540b5534bd79636d85433dde93fc6e 3b727a5673540b5534bd79636d85433dde93fc6e
Total tests
8888
Failing since
#1327 (Changes by Rainer Prosi <rainer.prosi@heidelberg.com>)
Fixed in
#1331 (Rebuilt by Rainer Prosi)

Responsible

This build has been failing since #1327
No one has taken responsibility

Code commits

Author Commit Message Commit date
Rainer Prosi <rainer.prosi@heidelberg.com> Rainer Prosi <rainer.prosi@heidelberg.com> 3b727a5673540b5534bd79636d85433dde93fc6e 3b727a5673540b5534bd79636d85433dde93fc6e test fixes

Tests

New test failures 8
Status Test View job Duration
Collapse Failed JDFQueueEntryTest testSetPriority History
build MACOSX < 1 sec
java.lang.IndexOutOfBoundsException: Index: 1, Size: 1
	at org.cip4.jdflib.jmf.JDFQueueEntryTest.testSetPriority(JDFQueueEntryTest.java:175)
Collapse Failed JDFQueueEntryTest testSetQueueEntryStatus History
build MACOSX < 1 sec
java.lang.IndexOutOfBoundsException: Index: 4, Size: 4
	at org.cip4.jdflib.jmf.JDFQueueEntryTest.testSetQueueEntryStatus(JDFQueueEntryTest.java:220)
Collapse Failed JDFQueueEntryTest testSetPriority History
build WINDOWS < 1 sec
java.lang.IndexOutOfBoundsException: Index: 1, Size: 1
	at org.cip4.jdflib.jmf.JDFQueueEntryTest.testSetPriority(JDFQueueEntryTest.java:175)
Collapse Failed JDFQueueEntryTest testSetQueueEntryStatus History
build WINDOWS < 1 sec
java.lang.IndexOutOfBoundsException: Index: 4, Size: 4
	at org.cip4.jdflib.jmf.JDFQueueEntryTest.testSetQueueEntryStatus(JDFQueueEntryTest.java:220)
Collapse Failed QueueTest testOpenClose History
build WINDOWS < 1 sec
java.lang.IndexOutOfBoundsException: Index: 1, Size: 1
	at org.cip4.jdflib.jmf.QueueTest.testOpenClose(QueueTest.java:202)
Collapse Failed QueueTest testCreateQueueEntry History
build WINDOWS < 1 sec
java.lang.IndexOutOfBoundsException: Index: 1, Size: 1
	at org.cip4.jdflib.jmf.QueueTest.testCreateQueueEntry(QueueTest.java:166)
Collapse Failed QueueTest testThreads History
build WINDOWS < 1 sec
java.lang.IndexOutOfBoundsException: Index: 100, Size: 100
	at org.cip4.jdflib.jmf.QueueTest.testThreads(QueueTest.java:375)
Collapse Failed QueueTest testSortCompleted History
build WINDOWS < 1 sec
java.lang.IndexOutOfBoundsException: Index: 1, Size: 1
	at org.cip4.jdflib.jmf.QueueTest.testSortCompleted(QueueTest.java:344)
Existing test failures 6
Status Test Failing since View job Duration
java.lang.IndexOutOfBoundsException: Index: 1, Size: 1
	at org.cip4.jdflib.jmf.JDFQueueEntryTest.testSetPriority(JDFQueueEntryTest.java:175)
java.lang.IndexOutOfBoundsException: Index: 4, Size: 4
	at org.cip4.jdflib.jmf.JDFQueueEntryTest.testSetQueueEntryStatus(JDFQueueEntryTest.java:220)
java.lang.IndexOutOfBoundsException: Index: 1, Size: 1
	at org.cip4.jdflib.jmf.QueueTest.testOpenClose(QueueTest.java:202)
java.lang.IndexOutOfBoundsException: Index: 1, Size: 1
	at org.cip4.jdflib.jmf.QueueTest.testCreateQueueEntry(QueueTest.java:166)
java.lang.IndexOutOfBoundsException: Index: 1, Size: 1
	at org.cip4.jdflib.jmf.QueueTest.testThreads(QueueTest.java:375)
java.lang.IndexOutOfBoundsException: Index: 1, Size: 1
	at org.cip4.jdflib.jmf.QueueTest.testSortCompleted(QueueTest.java:344)
Fixed tests 23
Status Test Failing since View job Duration
Successful VarnishTest testCombinedVarnish History
Failing since build #1327 (Changes by Rainer Prosi <rainer.prosi@heidelberg.com>) build WINDOWS 2 secs
Successful XJDFTest testDependencies History
Failing since build #1327 (Changes by Rainer Prosi <rainer.prosi@heidelberg.com>) build LINUX < 1 sec
Successful XJDFTest testDependencies History
Failing since build #1327 (Changes by Rainer Prosi <rainer.prosi@heidelberg.com>) build MACOSX < 1 sec
Successful XJDFTest testFromXJDFMedia History
Failing since build #1327 (Changes by Rainer Prosi <rainer.prosi@heidelberg.com>) build WINDOWS < 1 sec
Successful XJDFTest testDependencies History
Failing since build #1327 (Changes by Rainer Prosi <rainer.prosi@heidelberg.com>) build WINDOWS < 1 sec
Successful XJDFAdditionalExampleTest testSeparationSplit History
Failing since build #1327 (Changes by Rainer Prosi <rainer.prosi@heidelberg.com>) build WINDOWS 1 sec
Successful JDFToXJDFConverterTest testCleanupFalse History
Failing since build #1327 (Changes by Rainer Prosi <rainer.prosi@heidelberg.com>) build LINUX < 1 sec
Successful JDFToXJDFConverterTest testCleanupFalse History
Failing since build #1327 (Changes by Rainer Prosi <rainer.prosi@heidelberg.com>) build MACOSX < 1 sec
Successful JDFToXJDFConverterTest testColorantControl History
Failing since build #1327 (Changes by Rainer Prosi <rainer.prosi@heidelberg.com>) build WINDOWS < 1 sec
Successful JDFToXJDFConverterTest testColorPoolSpace History
Failing since build #1327 (Changes by Rainer Prosi <rainer.prosi@heidelberg.com>) build WINDOWS < 1 sec
Successful JDFToXJDFConverterTest testLayoutMedia History
Failing since build #1327 (Changes by Rainer Prosi <rainer.prosi@heidelberg.com>) build WINDOWS < 1 sec
Successful JDFToXJDFConverterTest testCleanupFalse History
Failing since build #1327 (Changes by Rainer Prosi <rainer.prosi@heidelberg.com>) build WINDOWS < 1 sec
Successful JDFToXJDFConverterTest testMediaInline History
Failing since build #1327 (Changes by Rainer Prosi <rainer.prosi@heidelberg.com>) build WINDOWS < 1 sec
Successful JDFToXJDFConverterTest testRefMediaFromInline History
Failing since build #1327 (Changes by Rainer Prosi <rainer.prosi@heidelberg.com>) build WINDOWS < 1 sec
Successful JDFToXJDFConverterTest testMediaComponentIn History
Failing since build #1327 (Changes by Rainer Prosi <rainer.prosi@heidelberg.com>) build WINDOWS < 1 sec
Successful JDFToXJDFConverterTest testColorantControlRefPool History
Failing since build #1327 (Changes by Rainer Prosi <rainer.prosi@heidelberg.com>) build WINDOWS < 1 sec
Successful MultiXJDFCombinerTest testSammelDrop History
Failing since build #1327 (Changes by Rainer Prosi <rainer.prosi@heidelberg.com>) build WINDOWS < 1 sec
Successful MISCPGoldenTicketTest testMISCPGrayBoxFrontBack History
Failing since build #1327 (Changes by Rainer Prosi <rainer.prosi@heidelberg.com>) build WINDOWS < 1 sec
Successful MISCPGoldenTicketTest testMISCPProductGrayBoxBrochure History
Failing since build #1327 (Changes by Rainer Prosi <rainer.prosi@heidelberg.com>) build WINDOWS 1 sec
Successful MISCPGoldenTicketTest testMISCPGrayBoxSimplexPoster History
Failing since build #1327 (Changes by Rainer Prosi <rainer.prosi@heidelberg.com>) build WINDOWS < 1 sec
Successful MISCPGoldenTicketTest testIdenticalInk History
Failing since build #1327 (Changes by Rainer Prosi <rainer.prosi@heidelberg.com>) build WINDOWS 3 secs
Successful MISCPGoldenTicketTest testMISCPGrayBox41Poster History
Failing since build #1327 (Changes by Rainer Prosi <rainer.prosi@heidelberg.com>) build WINDOWS < 1 sec
Successful MISCPGoldenTicketTest testMISCPProductBrochure History
Failing since build #1327 (Changes by Rainer Prosi <rainer.prosi@heidelberg.com>) build WINDOWS 1 sec

Shared artifacts

Artifact File size
doc 0 bytes
src 0 bytes
jar 0 bytes
samples 136 KB