Stages & jobs

  1. Default Stage

Build result summary

Details

Completed
Duration
27 minutes
Labels
None
Revision
66a2acfcc0e0772227795053710bce0384d06900 66a2acfcc0e0772227795053710bce0384d06900
Total tests
10275
Fixed in
#1334 (Changes by Rainer Prosi <rainer.prosi@heidelberg.com>)

Responsible

No one has taken responsibility for this failure

Code commits

Author Commit Message Commit date
Rainer Prosi <rainer.prosi@heidelberg.com> Rainer Prosi <rainer.prosi@heidelberg.com> 66a2acfcc0e0772227795053710bce0384d06900 66a2acfcc0e0772227795053710bce0384d06900 made idle an atoic int

Tests

New test failures 3
Status Test View job Duration
Collapse Failed OrderedTaskQueueTest testQueue History
build LINUX < 1 sec
java.lang.AssertionError: expected: java.lang.Integer<0> but was: java.util.concurrent.atomic.AtomicInteger<0>
	at org.cip4.jdflib.util.thread.OrderedTaskQueueTest.testQueue(OrderedTaskQueueTest.java:238)
Collapse Failed OrderedTaskQueueTest testQueue History
build MACOSX < 1 sec
java.lang.AssertionError: expected: java.lang.Integer<0> but was: java.util.concurrent.atomic.AtomicInteger<0>
	at org.cip4.jdflib.util.thread.OrderedTaskQueueTest.testQueue(OrderedTaskQueueTest.java:238)
Collapse Failed OrderedTaskQueueTest testQueue History
build WINDOWS 1 sec
java.lang.AssertionError: expected: java.lang.Integer<0> but was: java.util.concurrent.atomic.AtomicInteger<0>
	at org.cip4.jdflib.util.thread.OrderedTaskQueueTest.testQueue(OrderedTaskQueueTest.java:238)

Shared artifacts

Artifact File size
doc 0 bytes
src 0 bytes
jar 0 bytes
samples 136 KB