Stages & jobs

  1. Default Stage

Test results

  • 10.275 tests in total
  • 3 tests failed
  • 3 failures are new
  • 18 tests were quarantined / skipped
  • 33 minutes taken in total.
New test failures 3
Status Test View job Duration
Collapse Failed OrderedTaskQueueTest testQueue History
build LINUX < 1 sec
java.lang.AssertionError: expected: java.lang.Integer<0> but was: java.util.concurrent.atomic.AtomicInteger<0>
	at org.cip4.jdflib.util.thread.OrderedTaskQueueTest.testQueue(OrderedTaskQueueTest.java:238)
Collapse Failed OrderedTaskQueueTest testQueue History
build MACOSX < 1 sec
java.lang.AssertionError: expected: java.lang.Integer<0> but was: java.util.concurrent.atomic.AtomicInteger<0>
	at org.cip4.jdflib.util.thread.OrderedTaskQueueTest.testQueue(OrderedTaskQueueTest.java:238)
Collapse Failed OrderedTaskQueueTest testQueue History
build WINDOWS 1 sec
java.lang.AssertionError: expected: java.lang.Integer<0> but was: java.util.concurrent.atomic.AtomicInteger<0>
	at org.cip4.jdflib.util.thread.OrderedTaskQueueTest.testQueue(OrderedTaskQueueTest.java:238)
Skipped tests 18
Status Test Failing since View job
Skipped TestJDF testSpawnedResources History
build LINUX
Skipped TestJDF testCheckSpawnedResources History
build LINUX
Skipped TestJDF fixExampleVersions History
build LINUX
Skipped TestJDF testSpawnedResources History
build MACOSX
Skipped TestJDF testCheckSpawnedResources History
build MACOSX
Skipped TestJDF fixExampleVersions History
build MACOSX
Skipped TestJDF testSpawnedResources History
build WINDOWS
Skipped TestJDF testCheckSpawnedResources History
build WINDOWS
Skipped TestJDF fixExampleVersions History
build WINDOWS
Skipped StrippingTest testCommonFolds History
build LINUX
Skipped StrippingTest testCommonFolds History
build MACOSX
Skipped StrippingTest testCommonFolds History
build WINDOWS
Skipped MultiXJDFCombinerTest testSammel19 History
build LINUX
Skipped MultiXJDFCombinerTest testSammel19 History
build MACOSX
Skipped MultiXJDFCombinerTest testSammel19 History
build WINDOWS
Skipped OrderedTaskQueueTest testInterruptTask History
build LINUX
Skipped OrderedTaskQueueTest testInterruptTask History
build MACOSX
Skipped OrderedTaskQueueTest testInterruptTask History
build WINDOWS