Stages & jobs

  1. Default Stage

Build result summary

Details

Completed
Duration
28 minutes
Labels
None
Revision
e4af9ec4e11520e28a1d8f059ba1e223bfc43130 e4af9ec4e11520e28a1d8f059ba1e223bfc43130
Total tests
10308
Fixed in
#1348 (Changes by Rainer Prosi <rainer.prosi@heidelberg.com>)

Responsible

No one has taken responsibility for this failure

Code commits

Author Commit Message Commit date
Rainer Prosi <rainer.prosi@heidelberg.com> Rainer Prosi <rainer.prosi@heidelberg.com> e4af9ec4e11520e28a1d8f059ba1e223bfc43130 e4af9ec4e11520e28a1d8f059ba1e223bfc43130 schema updates

Tests

New test failures 39
Status Test View job Duration
Collapse Failed XJDFSchemaTest testAuditExtensions History
build LINUX < 1 sec
java.lang.AssertionError: Valid
	at org.cip4.jdflib.extensions.XJDFSchemaTest.testAuditExtensions(XJDFSchemaTest.java:270)
Collapse Failed XJDFSchemaTest testVersion21 History
build LINUX < 1 sec
java.lang.AssertionError: Valid
	at org.cip4.jdflib.extensions.XJDFSchemaTest.testVersion21(XJDFSchemaTest.java:132)
Collapse Failed XJDFSchemaTest testProductPV History
build LINUX < 1 sec
java.lang.AssertionError
	at org.cip4.jdflib.extensions.XJDFSchemaTest.testProductPV(XJDFSchemaTest.java:146)
Collapse Failed XJDFSchemaTest testMessageExtensions History
build LINUX < 1 sec
java.lang.AssertionError: Valid
	at org.cip4.jdflib.extensions.XJDFSchemaTest.testMessageExtensions(XJDFSchemaTest.java:285)
Collapse Failed XJDFSchemaTest testProductPVBind History
build LINUX < 1 sec
java.lang.AssertionError: Valid
	at org.cip4.jdflib.extensions.XJDFSchemaTest.testProductPVBind(XJDFSchemaTest.java:165)
Collapse Failed XJDFSchemaTest testAuditExtensions History
build MACOSX < 1 sec
java.lang.AssertionError: Valid
	at org.cip4.jdflib.extensions.XJDFSchemaTest.testAuditExtensions(XJDFSchemaTest.java:270)
Collapse Failed XJDFSchemaTest testVersion21 History
build MACOSX < 1 sec
java.lang.AssertionError: Valid
	at org.cip4.jdflib.extensions.XJDFSchemaTest.testVersion21(XJDFSchemaTest.java:132)
Collapse Failed XJDFSchemaTest testProductPV History
build MACOSX < 1 sec
java.lang.AssertionError
	at org.cip4.jdflib.extensions.XJDFSchemaTest.testProductPV(XJDFSchemaTest.java:146)
Collapse Failed XJDFSchemaTest testMessageExtensions History
build MACOSX < 1 sec
java.lang.AssertionError: Valid
	at org.cip4.jdflib.extensions.XJDFSchemaTest.testMessageExtensions(XJDFSchemaTest.java:285)
Collapse Failed XJDFSchemaTest testProductPVBind History
build MACOSX < 1 sec
java.lang.AssertionError: Valid
	at org.cip4.jdflib.extensions.XJDFSchemaTest.testProductPVBind(XJDFSchemaTest.java:165)
Collapse Failed XJDFSchemaTest testVersion21 History
build WINDOWS < 1 sec
java.lang.AssertionError: Valid
	at org.cip4.jdflib.extensions.XJDFSchemaTest.testVersion21(XJDFSchemaTest.java:132)
Collapse Failed XJDFSchemaTest testProductPV History
build WINDOWS < 1 sec
java.lang.AssertionError
	at org.cip4.jdflib.extensions.XJDFSchemaTest.testProductPV(XJDFSchemaTest.java:146)
Collapse Failed XJDFSchemaTest testMessageExtensions History
build WINDOWS < 1 sec
java.lang.AssertionError: Valid
	at org.cip4.jdflib.extensions.XJDFSchemaTest.testMessageExtensions(XJDFSchemaTest.java:285)
Collapse Failed XJDFSchemaTest testProductPVBind History
build WINDOWS < 1 sec
java.lang.AssertionError: Valid
	at org.cip4.jdflib.extensions.XJDFSchemaTest.testProductPVBind(XJDFSchemaTest.java:165)
Collapse Failed XJDFSchemaTest testAuditExtensions History
build WINDOWS < 1 sec
java.lang.AssertionError: Valid
	at org.cip4.jdflib.extensions.XJDFSchemaTest.testAuditExtensions(XJDFSchemaTest.java:270)
Collapse Failed XJDFQCExampleTest testInspectionQualityControlParams History
build LINUX < 1 sec
java.lang.AssertionError: Valid
	at org.cip4.jdflib.extensions.examples.XJDFQCExampleTest.testInspectionQualityControlParams(XJDFQCExampleTest.java:147)
Collapse Failed XJDFQCExampleTest testInspectionQualityControlResultXJMF History
build LINUX < 1 sec
java.lang.AssertionError: Valid
	at org.cip4.jdflib.extensions.examples.XJDFQCExampleTest.testInspectionQualityControlResultXJMF(XJDFQCExampleTest.java:251)
Collapse Failed XJDFQCExampleTest testColorQualityControl History
build LINUX 1 sec
java.lang.AssertionError: Valid
	at org.cip4.jdflib.extensions.examples.XJDFQCExampleTest.testColorQualityControl(XJDFQCExampleTest.java:123)
Collapse Failed XJDFQCExampleTest testInspectionQualityControlResult History
build LINUX < 1 sec
java.lang.AssertionError: Valid
	at org.cip4.jdflib.extensions.examples.XJDFQCExampleTest.testInspectionQualityControlResult(XJDFQCExampleTest.java:198)
Collapse Failed XJDFQCExampleTest testInspectionQualityControlParams History
build MACOSX < 1 sec
java.lang.AssertionError: Valid
	at org.cip4.jdflib.extensions.examples.XJDFQCExampleTest.testInspectionQualityControlParams(XJDFQCExampleTest.java:147)
Collapse Failed XJDFQCExampleTest testInspectionQualityControlResultXJMF History
build MACOSX < 1 sec
java.lang.AssertionError: Valid
	at org.cip4.jdflib.extensions.examples.XJDFQCExampleTest.testInspectionQualityControlResultXJMF(XJDFQCExampleTest.java:251)
Collapse Failed XJDFQCExampleTest testColorQualityControl History
build MACOSX < 1 sec
java.lang.AssertionError: Valid
	at org.cip4.jdflib.extensions.examples.XJDFQCExampleTest.testColorQualityControl(XJDFQCExampleTest.java:123)
Collapse Failed XJDFQCExampleTest testInspectionQualityControlResult History
build MACOSX < 1 sec
java.lang.AssertionError: Valid
	at org.cip4.jdflib.extensions.examples.XJDFQCExampleTest.testInspectionQualityControlResult(XJDFQCExampleTest.java:198)
Collapse Failed XJDFQCExampleTest testInspectionQualityControlParams History
build WINDOWS < 1 sec
java.lang.AssertionError: Valid
	at org.cip4.jdflib.extensions.examples.XJDFQCExampleTest.testInspectionQualityControlParams(XJDFQCExampleTest.java:147)
Collapse Failed XJDFQCExampleTest testInspectionQualityControlResultXJMF History
build WINDOWS < 1 sec
java.lang.AssertionError: Valid
	at org.cip4.jdflib.extensions.examples.XJDFQCExampleTest.testInspectionQualityControlResultXJMF(XJDFQCExampleTest.java:251)
Collapse Failed XJDFQCExampleTest testColorQualityControl History
build WINDOWS < 1 sec
java.lang.AssertionError: Valid
	at org.cip4.jdflib.extensions.examples.XJDFQCExampleTest.testColorQualityControl(XJDFQCExampleTest.java:123)
Collapse Failed XJDFQCExampleTest testInspectionQualityControlResult History
build WINDOWS < 1 sec
java.lang.AssertionError: Valid
	at org.cip4.jdflib.extensions.examples.XJDFQCExampleTest.testInspectionQualityControlResult(XJDFQCExampleTest.java:198)
Collapse Failed XJDFResourceExampleTest testPrintConditions21 History
build LINUX < 1 sec
java.lang.AssertionError: Valid
	at org.cip4.jdflib.extensions.examples.XJDFResourceExampleTest.testPrintConditions21(XJDFResourceExampleTest.java:234)
Collapse Failed XJDFResourceExampleTest testPrintConditionCoverBody History
build LINUX < 1 sec
java.lang.AssertionError: Valid
	at org.cip4.jdflib.extensions.examples.XJDFResourceExampleTest.testPrintConditionCoverBody(XJDFResourceExampleTest.java:296)
Collapse Failed XJDFResourceExampleTest testPrintConditions21 History
build MACOSX < 1 sec
java.lang.AssertionError: Valid
	at org.cip4.jdflib.extensions.examples.XJDFResourceExampleTest.testPrintConditions21(XJDFResourceExampleTest.java:234)
Collapse Failed XJDFResourceExampleTest testPrintConditionCoverBody History
build MACOSX < 1 sec
java.lang.AssertionError: Valid
	at org.cip4.jdflib.extensions.examples.XJDFResourceExampleTest.testPrintConditionCoverBody(XJDFResourceExampleTest.java:296)
Collapse Failed XJDFResourceExampleTest testPrintConditions21 History
build WINDOWS < 1 sec
java.lang.AssertionError: Valid
	at org.cip4.jdflib.extensions.examples.XJDFResourceExampleTest.testPrintConditions21(XJDFResourceExampleTest.java:234)
Collapse Failed XJDFResourceExampleTest testPrintConditionCoverBody History
build WINDOWS < 1 sec
java.lang.AssertionError: Valid
	at org.cip4.jdflib.extensions.examples.XJDFResourceExampleTest.testPrintConditionCoverBody(XJDFResourceExampleTest.java:296)
Collapse Failed XJDFRunListTest testMultiSet History
build LINUX < 1 sec
java.lang.AssertionError: Valid
	at org.cip4.jdflib.extensions.examples.XJDFRunListTest.testMultiSet(XJDFRunListTest.java:267)
Collapse Failed XJDFRunListTest testMultiSet History
build MACOSX < 1 sec
java.lang.AssertionError: Valid
	at org.cip4.jdflib.extensions.examples.XJDFRunListTest.testMultiSet(XJDFRunListTest.java:267)
Collapse Failed XJDFRunListTest testMultiSet History
build WINDOWS < 1 sec
java.lang.AssertionError: Valid
	at org.cip4.jdflib.extensions.examples.XJDFRunListTest.testMultiSet(XJDFRunListTest.java:267)
Collapse Failed XJMFExampleTest testResponsePrintCondition History
build LINUX < 1 sec
java.lang.AssertionError: Valid
	at org.cip4.jdflib.extensions.examples.XJMFExampleTest.testResponsePrintCondition(XJMFExampleTest.java:377)
Collapse Failed XJMFExampleTest testResponsePrintCondition History
build MACOSX < 1 sec
java.lang.AssertionError: Valid
	at org.cip4.jdflib.extensions.examples.XJMFExampleTest.testResponsePrintCondition(XJMFExampleTest.java:377)
Collapse Failed XJMFExampleTest testResponsePrintCondition History
build WINDOWS < 1 sec
java.lang.AssertionError: Valid
	at org.cip4.jdflib.extensions.examples.XJMFExampleTest.testResponsePrintCondition(XJMFExampleTest.java:377)

Shared artifacts

Artifact File size
doc 0 bytes
src 0 bytes
jar 0 bytes
samples 141 KB