Stages & jobs

  1. Default Stage

Build result summary

Details

Completed
Duration
30 minutes
Labels
None
Revision
ad1467209fb905e57916a96baca903117f23bbd3 ad1467209fb905e57916a96baca903117f23bbd3
Total tests
10311
Failing since
#1346 (Changes by Rainer Prosi <rainer.prosi@heidelberg.com>)
Fixed in
#1348 (Changes by Rainer Prosi <rainer.prosi@heidelberg.com>)

Responsible

This build has been failing since #1346
No one has taken responsibility

Code commits

Author Commit Message Commit date
Rainer Prosi <rainer.prosi@heidelberg.com> Rainer Prosi <rainer.prosi@heidelberg.com> ad1467209fb905e57916a96baca903117f23bbd3 ad1467209fb905e57916a96baca903117f23bbd3 XJDF conversion of resource signals - id handling

Tests

Existing test failures 39
Status Test Failing since View job Duration
java.lang.AssertionError: Valid
	at org.cip4.jdflib.extensions.XJDFSchemaTest.testProductPVBind(XJDFSchemaTest.java:165)
java.lang.AssertionError: Valid
	at org.cip4.jdflib.extensions.XJDFSchemaTest.testAuditExtensions(XJDFSchemaTest.java:270)
java.lang.AssertionError: Valid
	at org.cip4.jdflib.extensions.XJDFSchemaTest.testVersion21(XJDFSchemaTest.java:132)
java.lang.AssertionError
	at org.cip4.jdflib.extensions.XJDFSchemaTest.testProductPV(XJDFSchemaTest.java:146)
java.lang.AssertionError: Valid
	at org.cip4.jdflib.extensions.XJDFSchemaTest.testMessageExtensions(XJDFSchemaTest.java:285)
java.lang.AssertionError: Valid
	at org.cip4.jdflib.extensions.XJDFSchemaTest.testAuditExtensions(XJDFSchemaTest.java:270)
java.lang.AssertionError: Valid
	at org.cip4.jdflib.extensions.XJDFSchemaTest.testVersion21(XJDFSchemaTest.java:132)
java.lang.AssertionError
	at org.cip4.jdflib.extensions.XJDFSchemaTest.testProductPV(XJDFSchemaTest.java:146)
java.lang.AssertionError: Valid
	at org.cip4.jdflib.extensions.XJDFSchemaTest.testMessageExtensions(XJDFSchemaTest.java:285)
java.lang.AssertionError: Valid
	at org.cip4.jdflib.extensions.XJDFSchemaTest.testProductPVBind(XJDFSchemaTest.java:165)
java.lang.AssertionError: Valid
	at org.cip4.jdflib.extensions.XJDFSchemaTest.testAuditExtensions(XJDFSchemaTest.java:270)
java.lang.AssertionError: Valid
	at org.cip4.jdflib.extensions.XJDFSchemaTest.testVersion21(XJDFSchemaTest.java:132)
java.lang.AssertionError
	at org.cip4.jdflib.extensions.XJDFSchemaTest.testProductPV(XJDFSchemaTest.java:146)
java.lang.AssertionError: Valid
	at org.cip4.jdflib.extensions.XJDFSchemaTest.testMessageExtensions(XJDFSchemaTest.java:285)
java.lang.AssertionError: Valid
	at org.cip4.jdflib.extensions.XJDFSchemaTest.testProductPVBind(XJDFSchemaTest.java:165)
java.lang.AssertionError: Valid
	at org.cip4.jdflib.extensions.examples.XJDFQCExampleTest.testInspectionQualityControlParams(XJDFQCExampleTest.java:147)
java.lang.AssertionError: Valid
	at org.cip4.jdflib.extensions.examples.XJDFQCExampleTest.testInspectionQualityControlResultXJMF(XJDFQCExampleTest.java:251)
java.lang.AssertionError: Valid
	at org.cip4.jdflib.extensions.examples.XJDFQCExampleTest.testColorQualityControl(XJDFQCExampleTest.java:123)
java.lang.AssertionError: Valid
	at org.cip4.jdflib.extensions.examples.XJDFQCExampleTest.testInspectionQualityControlResult(XJDFQCExampleTest.java:198)
java.lang.AssertionError: Valid
	at org.cip4.jdflib.extensions.examples.XJDFQCExampleTest.testInspectionQualityControlParams(XJDFQCExampleTest.java:147)
java.lang.AssertionError: Valid
	at org.cip4.jdflib.extensions.examples.XJDFQCExampleTest.testInspectionQualityControlResultXJMF(XJDFQCExampleTest.java:251)
java.lang.AssertionError: Valid
	at org.cip4.jdflib.extensions.examples.XJDFQCExampleTest.testColorQualityControl(XJDFQCExampleTest.java:123)
java.lang.AssertionError: Valid
	at org.cip4.jdflib.extensions.examples.XJDFQCExampleTest.testInspectionQualityControlResult(XJDFQCExampleTest.java:198)
java.lang.AssertionError: Valid
	at org.cip4.jdflib.extensions.examples.XJDFQCExampleTest.testInspectionQualityControlParams(XJDFQCExampleTest.java:147)
java.lang.AssertionError: Valid
	at org.cip4.jdflib.extensions.examples.XJDFQCExampleTest.testInspectionQualityControlResultXJMF(XJDFQCExampleTest.java:251)
java.lang.AssertionError: Valid
	at org.cip4.jdflib.extensions.examples.XJDFQCExampleTest.testColorQualityControl(XJDFQCExampleTest.java:123)
java.lang.AssertionError: Valid
	at org.cip4.jdflib.extensions.examples.XJDFQCExampleTest.testInspectionQualityControlResult(XJDFQCExampleTest.java:198)
java.lang.AssertionError: Valid
	at org.cip4.jdflib.extensions.examples.XJDFResourceExampleTest.testPrintConditions21(XJDFResourceExampleTest.java:234)
java.lang.AssertionError: Valid
	at org.cip4.jdflib.extensions.examples.XJDFResourceExampleTest.testPrintConditionCoverBody(XJDFResourceExampleTest.java:296)
java.lang.AssertionError: Valid
	at org.cip4.jdflib.extensions.examples.XJDFResourceExampleTest.testPrintConditions21(XJDFResourceExampleTest.java:234)
java.lang.AssertionError: Valid
	at org.cip4.jdflib.extensions.examples.XJDFResourceExampleTest.testPrintConditionCoverBody(XJDFResourceExampleTest.java:296)
java.lang.AssertionError: Valid
	at org.cip4.jdflib.extensions.examples.XJDFResourceExampleTest.testPrintConditions21(XJDFResourceExampleTest.java:234)
java.lang.AssertionError: Valid
	at org.cip4.jdflib.extensions.examples.XJDFResourceExampleTest.testPrintConditionCoverBody(XJDFResourceExampleTest.java:296)
java.lang.AssertionError: Valid
	at org.cip4.jdflib.extensions.examples.XJDFRunListTest.testMultiSet(XJDFRunListTest.java:267)
java.lang.AssertionError: Valid
	at org.cip4.jdflib.extensions.examples.XJDFRunListTest.testMultiSet(XJDFRunListTest.java:267)
java.lang.AssertionError: Valid
	at org.cip4.jdflib.extensions.examples.XJDFRunListTest.testMultiSet(XJDFRunListTest.java:267)
java.lang.AssertionError: Valid
	at org.cip4.jdflib.extensions.examples.XJMFExampleTest.testResponsePrintCondition(XJMFExampleTest.java:377)
java.lang.AssertionError: Valid
	at org.cip4.jdflib.extensions.examples.XJMFExampleTest.testResponsePrintCondition(XJMFExampleTest.java:377)
java.lang.AssertionError: Valid
	at org.cip4.jdflib.extensions.examples.XJMFExampleTest.testResponsePrintCondition(XJMFExampleTest.java:377)

Shared artifacts

Artifact File size
doc 0 bytes
src 0 bytes
jar 0 bytes
samples 141 KB