Stages & jobs

  1. Default Stage

Build result summary

Details

Completed
Duration
29 minutes
Labels
None
Revision
48b3ef56df010b851da1f55492a88d3f99670f29 48b3ef56df010b851da1f55492a88d3f99670f29
Total tests
10899
Fixed in
#1530 (Changes by Rainer Prosi <rainer.prosi@heidelberg.com>)

Tests

Responsible

No one has taken responsibility for this failure

Code commits

Author Commit Message Commit date
Rainer Prosi <rainer.prosi@heidelberg.com> Rainer Prosi <rainer.prosi@heidelberg.com> 48b3ef56df010b851da1f55492a88d3f99670f29 48b3ef56df010b851da1f55492a88d3f99670f29 update using new schema

Tests

New test failures 9
Status Test View job Duration
Collapse Failed JDFResourceLinkTest testDraftOK History
build LINUX < 1 sec
java.lang.AssertionError: 1.2 valid
	at org.cip4.jdflib.core.JDFResourceLinkTest.testDraftOK(JDFResourceLinkTest.java:278)
Collapse Failed JDFResourceLinkTest testDraftOK History
build MACOSX < 1 sec
java.lang.AssertionError: 1.2 valid
	at org.cip4.jdflib.core.JDFResourceLinkTest.testDraftOK(JDFResourceLinkTest.java:278)
Collapse Failed JDFResourceLinkTest testDraftOK History
build WINDOWS < 1 sec
java.lang.AssertionError: 1.2 valid
	at org.cip4.jdflib.core.JDFResourceLinkTest.testDraftOK(JDFResourceLinkTest.java:278)
Collapse Failed JMFToXJMFConverterTest testSubscriptionFilter History
build LINUX < 1 sec
java.lang.AssertionError: expected null, but was:<<?xml version="1.0" encoding="UTF-8"?>
<SubscriptionFilter xmlns="http://www.CIP4.org/JDFSchema_2_0" JobID="J1"/>
>
java.lang.AssertionError: 
expected null, but was:<<?xml version="1.0" encoding="UTF-8"?>
<SubscriptionFilter xmlns="http://www.CIP4.org/JDFSchema_2_0" JobID="J1"/>
>
	at org.cip4.jdflib.extensions.xjdfwalker.JMFToXJMFConverterTest.testSubscriptionFilter(JMFToXJMFConverterTest.java:434)
Collapse Failed JMFToXJMFConverterTest testBuildResourceQueryPaperLot History
build LINUX < 1 sec
java.lang.AssertionError: expected:<L1> but was:<null>
	at org.cip4.jdflib.extensions.xjdfwalker.JMFToXJMFConverterTest.testBuildResourceQueryPaperLot(JMFToXJMFConverterTest.java:676)
Collapse Failed JMFToXJMFConverterTest testBuildResourceQueryPaperLot History
build MACOSX < 1 sec
java.lang.AssertionError: expected:<L1> but was:<null>
	at org.cip4.jdflib.extensions.xjdfwalker.JMFToXJMFConverterTest.testBuildResourceQueryPaperLot(JMFToXJMFConverterTest.java:676)
Collapse Failed JMFToXJMFConverterTest testSubscriptionFilter History
build MACOSX < 1 sec
java.lang.AssertionError: expected null, but was:<<?xml version="1.0" encoding="UTF-8"?>
<SubscriptionFilter xmlns="http://www.CIP4.org/JDFSchema_2_0" JobID="J1"/>
>
java.lang.AssertionError: 
expected null, but was:<<?xml version="1.0" encoding="UTF-8"?>
<SubscriptionFilter xmlns="http://www.CIP4.org/JDFSchema_2_0" JobID="J1"/>
>
	at org.cip4.jdflib.extensions.xjdfwalker.JMFToXJMFConverterTest.testSubscriptionFilter(JMFToXJMFConverterTest.java:434)
Collapse Failed JMFToXJMFConverterTest testBuildResourceQueryPaperLot History
build WINDOWS < 1 sec
java.lang.AssertionError: expected:<L1> but was:<null>
	at org.cip4.jdflib.extensions.xjdfwalker.JMFToXJMFConverterTest.testBuildResourceQueryPaperLot(JMFToXJMFConverterTest.java:676)
Collapse Failed JMFToXJMFConverterTest testSubscriptionFilter History
build WINDOWS < 1 sec
java.lang.AssertionError: expected null, but was:<<?xml version="1.0" encoding="UTF-8"?>
<SubscriptionFilter xmlns="http://www.CIP4.org/JDFSchema_2_0" JobID="J1"/>
>
java.lang.AssertionError: 
expected null, but was:<<?xml version="1.0" encoding="UTF-8"?>
<SubscriptionFilter xmlns="http://www.CIP4.org/JDFSchema_2_0" JobID="J1"/>
>
	at org.cip4.jdflib.extensions.xjdfwalker.JMFToXJMFConverterTest.testSubscriptionFilter(JMFToXJMFConverterTest.java:434)

Shared artifacts

Artifact File size
samples 163 KB