Build: #1529 failed

Job: build LINUX failed

Stages & jobs

  1. Default Stage

Test results

  • 3.633 tests in total
  • 3 tests failed
  • 3 failures are new
  • 11 tests were quarantined / skipped
  • 9 minutes taken in total.

Build 1.529 has the following 3 errors: 3 new failure(s) occurred since the previous build.

New test failures 3
Status Test Duration
Collapse Failed JDFResourceLinkTest testDraftOK History
< 1 sec
java.lang.AssertionError: 1.2 valid
	at org.cip4.jdflib.core.JDFResourceLinkTest.testDraftOK(JDFResourceLinkTest.java:278)
Collapse Failed JMFToXJMFConverterTest testBuildResourceQueryPaperLot History
< 1 sec
java.lang.AssertionError: expected:<L1> but was:<null>
	at org.cip4.jdflib.extensions.xjdfwalker.JMFToXJMFConverterTest.testBuildResourceQueryPaperLot(JMFToXJMFConverterTest.java:676)
Collapse Failed JMFToXJMFConverterTest testSubscriptionFilter History
< 1 sec
java.lang.AssertionError: expected null, but was:<<?xml version="1.0" encoding="UTF-8"?>
<SubscriptionFilter xmlns="http://www.CIP4.org/JDFSchema_2_0" JobID="J1"/>
>
java.lang.AssertionError: 
expected null, but was:<<?xml version="1.0" encoding="UTF-8"?>
<SubscriptionFilter xmlns="http://www.CIP4.org/JDFSchema_2_0" JobID="J1"/>
>
	at org.cip4.jdflib.extensions.xjdfwalker.JMFToXJMFConverterTest.testSubscriptionFilter(JMFToXJMFConverterTest.java:434)