Build: #1346 failed

Job: build MACOSX failed

Stages & jobs

  1. Default Stage

Job result summary

Completed
Duration
26 minutes
Agent
MacOS Agent #1
Revision
e4af9ec4e11520e28a1d8f059ba1e223bfc43130 e4af9ec4e11520e28a1d8f059ba1e223bfc43130
Total tests
3436
Fixed in
#1348 (Code changes detected)

Tests

  • 3.436 tests in total
  • 13 tests failed
  • 13 failures are new
  • 6 tests were quarantined / skipped
  • 10 minutes taken in total.
New test failures 13
Status Test Duration
Collapse Failed XJDFSchemaTest testAuditExtensions History
< 1 sec
java.lang.AssertionError: Valid
	at org.cip4.jdflib.extensions.XJDFSchemaTest.testAuditExtensions(XJDFSchemaTest.java:270)
Collapse Failed XJDFSchemaTest testMessageExtensions History
< 1 sec
java.lang.AssertionError: Valid
	at org.cip4.jdflib.extensions.XJDFSchemaTest.testMessageExtensions(XJDFSchemaTest.java:285)
Collapse Failed XJDFSchemaTest testProductPV History
< 1 sec
java.lang.AssertionError
	at org.cip4.jdflib.extensions.XJDFSchemaTest.testProductPV(XJDFSchemaTest.java:146)
Collapse Failed XJDFSchemaTest testProductPVBind History
< 1 sec
java.lang.AssertionError: Valid
	at org.cip4.jdflib.extensions.XJDFSchemaTest.testProductPVBind(XJDFSchemaTest.java:165)
Collapse Failed XJDFSchemaTest testVersion21 History
< 1 sec
java.lang.AssertionError: Valid
	at org.cip4.jdflib.extensions.XJDFSchemaTest.testVersion21(XJDFSchemaTest.java:132)
Collapse Failed XJDFQCExampleTest testColorQualityControl History
< 1 sec
java.lang.AssertionError: Valid
	at org.cip4.jdflib.extensions.examples.XJDFQCExampleTest.testColorQualityControl(XJDFQCExampleTest.java:123)
Collapse Failed XJDFQCExampleTest testInspectionQualityControlParams History
< 1 sec
java.lang.AssertionError: Valid
	at org.cip4.jdflib.extensions.examples.XJDFQCExampleTest.testInspectionQualityControlParams(XJDFQCExampleTest.java:147)
Collapse Failed XJDFQCExampleTest testInspectionQualityControlResult History
< 1 sec
java.lang.AssertionError: Valid
	at org.cip4.jdflib.extensions.examples.XJDFQCExampleTest.testInspectionQualityControlResult(XJDFQCExampleTest.java:198)
Collapse Failed XJDFQCExampleTest testInspectionQualityControlResultXJMF History
< 1 sec
java.lang.AssertionError: Valid
	at org.cip4.jdflib.extensions.examples.XJDFQCExampleTest.testInspectionQualityControlResultXJMF(XJDFQCExampleTest.java:251)
Collapse Failed XJDFResourceExampleTest testPrintConditionCoverBody History
< 1 sec
java.lang.AssertionError: Valid
	at org.cip4.jdflib.extensions.examples.XJDFResourceExampleTest.testPrintConditionCoverBody(XJDFResourceExampleTest.java:296)
Collapse Failed XJDFResourceExampleTest testPrintConditions21 History
< 1 sec
java.lang.AssertionError: Valid
	at org.cip4.jdflib.extensions.examples.XJDFResourceExampleTest.testPrintConditions21(XJDFResourceExampleTest.java:234)
Collapse Failed XJDFRunListTest testMultiSet History
< 1 sec
java.lang.AssertionError: Valid
	at org.cip4.jdflib.extensions.examples.XJDFRunListTest.testMultiSet(XJDFRunListTest.java:267)
Collapse Failed XJMFExampleTest testResponsePrintCondition History
< 1 sec
java.lang.AssertionError: Valid
	at org.cip4.jdflib.extensions.examples.XJMFExampleTest.testResponsePrintCondition(XJMFExampleTest.java:377)

Error summary

The build generated some errors. See the full build log for more details.

log4j:WARN No appenders could be found for logger (org.cip4.jdflib.core.XMLDocTest).
log4j:WARN Please initialize the log4j system properly.
log4j:WARN See http://logging.apache.org/log4j/1.2/faq.html#noconfig for more info.
log4j:WARN No appenders could be found for logger (org.cip4.jdflib.extensions.xjdfwalker.jdftoxjdf.JDFToXJDF).
log4j:WARN Please initialize the log4j system properly.
log4j:WARN See http://logging.apache.org/log4j/1.2/faq.html#noconfig for more info.
log4j:WARN No appenders could be found for logger (org.cip4.jdflib.extensions.xjdfwalker.jdftoxjdf.JDFToXJDF).
log4j:WARN Please initialize the log4j system properly.
log4j:WARN See http://logging.apache.org/log4j/1.2/faq.html#noconfig for more info.