Build: #1529 failed

Job: build MACOSX failed

Stages & jobs

  1. Default Stage

Job result summary

Completed
Duration
27 minutes
Agent
MacOS Agent #2
Revision
48b3ef56df010b851da1f55492a88d3f99670f29 48b3ef56df010b851da1f55492a88d3f99670f29
Total tests
3633
Fixed in
#1530 (Code changes detected)

Tests

  • 3.633 tests in total
  • 3 tests failed
  • 3 failures are new
  • 11 tests were quarantined / skipped
  • 12 minutes taken in total.
New test failures 3
Status Test Duration
Collapse Failed JDFResourceLinkTest testDraftOK History
< 1 sec
java.lang.AssertionError: 1.2 valid
	at org.cip4.jdflib.core.JDFResourceLinkTest.testDraftOK(JDFResourceLinkTest.java:278)
Collapse Failed JMFToXJMFConverterTest testBuildResourceQueryPaperLot History
< 1 sec
java.lang.AssertionError: expected:<L1> but was:<null>
	at org.cip4.jdflib.extensions.xjdfwalker.JMFToXJMFConverterTest.testBuildResourceQueryPaperLot(JMFToXJMFConverterTest.java:676)
Collapse Failed JMFToXJMFConverterTest testSubscriptionFilter History
< 1 sec
java.lang.AssertionError: expected null, but was:<<?xml version="1.0" encoding="UTF-8"?>
<SubscriptionFilter xmlns="http://www.CIP4.org/JDFSchema_2_0" JobID="J1"/>
>
java.lang.AssertionError: 
expected null, but was:<<?xml version="1.0" encoding="UTF-8"?>
<SubscriptionFilter xmlns="http://www.CIP4.org/JDFSchema_2_0" JobID="J1"/>
>
	at org.cip4.jdflib.extensions.xjdfwalker.JMFToXJMFConverterTest.testSubscriptionFilter(JMFToXJMFConverterTest.java:434)

Error summary

The build generated some errors. See the full build log for more details.

log4j:WARN No appenders could be found for logger (org.cip4.jdflib.extensions.xjdfwalker.jdftoxjdf.JDFToXJDF).
log4j:WARN Please initialize the log4j system properly.
log4j:WARN See http://logging.apache.org/log4j/1.2/faq.html#noconfig for more info.