Stages & jobs

  1. Default Stage

Logs

The following logs have been generated by the jobs in this plan.
  • Expand all
  • Collapse all
Job Logs
Collapse build LINUX Default Stage Download or View
10-Aug-2019 15:58:53
10-Aug-2019 15:58:53 Results :
10-Aug-2019 15:58:53
10-Aug-2019 15:58:53 Failed tests:   testSetDescriptiveName(org.cip4.printtalk.PurchaseOrderTest): expected:<[Valid]> but was:<[Error]>
10-Aug-2019 15:58:53
10-Aug-2019 15:58:53 Tests run: 124, Failures: 1, Errors: 0, Skipped: 2
10-Aug-2019 15:58:53
10-Aug-2019 15:58:53 [INFO] ------------------------------------------------------------------------
10-Aug-2019 15:58:53 [INFO] BUILD FAILURE
10-Aug-2019 15:58:53 [INFO] ------------------------------------------------------------------------
10-Aug-2019 15:58:53 [INFO] Total time: 17.836 s
10-Aug-2019 15:58:53 [INFO] Finished at: 2019-08-10T13:58:53Z
10-Aug-2019 15:58:53 [INFO] Final Memory: 29M/292M
10-Aug-2019 15:58:53 [INFO] ------------------------------------------------------------------------
10-Aug-2019 15:58:53 [ERROR] Failed to execute goal org.apache.maven.plugins:maven-surefire-plugin:2.12.4:test (default-test) on project PrintTalkJ: There are test failures.
10-Aug-2019 15:58:53 [ERROR]
10-Aug-2019 15:58:53 [ERROR] Please refer to /home/cip4secretariat/bamboo/agent-2/xml-data/build-dir/LIB-PTKJ-LINUX/target/surefire-reports for the individual test results.
10-Aug-2019 15:58:53 [ERROR] -> [Help 1]
10-Aug-2019 15:58:53 [ERROR]
10-Aug-2019 15:58:53 [ERROR] To see the full stack trace of the errors, re-run Maven with the -e switch.
10-Aug-2019 15:58:53 [ERROR] Re-run Maven using the -X switch to enable full debug logging.
10-Aug-2019 15:58:53 [ERROR]
10-Aug-2019 15:58:53 [ERROR] For more information about the errors and possible solutions, please read the following articles:
10-Aug-2019 15:58:53 [ERROR] [Help 1] http://cwiki.apache.org/confluence/display/MAVEN/MojoFailureException
10-Aug-2019 15:58:54 Unable to publish artifact [site]: the source directory /home/cip4secretariat/bamboo/agent-2/xml-data/build-dir/LIB-PTKJ-LINUX/target/site does not exist.
Collapse build MACOSX Default Stage Download or View
10-Aug-2019 15:58:37 Tests run: 7, Failures: 0, Errors: 0, Skipped: 0, Time elapsed: 0.015 sec
10-Aug-2019 15:58:37
10-Aug-2019 15:58:37 Results :
10-Aug-2019 15:58:37
10-Aug-2019 15:58:37 Failed tests:   testSetDescriptiveName(org.cip4.printtalk.PurchaseOrderTest): expected:<[Valid]> but was:<[Error]>
10-Aug-2019 15:58:37
10-Aug-2019 15:58:37 Tests run: 124, Failures: 1, Errors: 0, Skipped: 2
10-Aug-2019 15:58:37
10-Aug-2019 15:58:37 [INFO] ------------------------------------------------------------------------
10-Aug-2019 15:58:37 [INFO] BUILD FAILURE
10-Aug-2019 15:58:37 [INFO] ------------------------------------------------------------------------
10-Aug-2019 15:58:37 [INFO] Total time: 12.605 s
10-Aug-2019 15:58:37 [INFO] Finished at: 2019-08-10T15:58:37+02:00
10-Aug-2019 15:58:37 [INFO] Final Memory: 26M/230M
10-Aug-2019 15:58:37 [INFO] ------------------------------------------------------------------------
10-Aug-2019 15:58:37 [ERROR] Failed to execute goal org.apache.maven.plugins:maven-surefire-plugin:2.12.4:test (default-test) on project PrintTalkJ: There are test failures.
10-Aug-2019 15:58:37 [ERROR]
10-Aug-2019 15:58:37 [ERROR] Please refer to /Users/cip4secretariat/Bamboo/bamboo-agent-1/xml-data/build-dir/LIB-PTKJ-MACOSX/target/surefire-reports for the individual test results.
10-Aug-2019 15:58:37 [ERROR] -> [Help 1]
10-Aug-2019 15:58:37 [ERROR]
10-Aug-2019 15:58:37 [ERROR] To see the full stack trace of the errors, re-run Maven with the -e switch.
10-Aug-2019 15:58:37 [ERROR] Re-run Maven using the -X switch to enable full debug logging.
10-Aug-2019 15:58:37 [ERROR]
10-Aug-2019 15:58:37 [ERROR] For more information about the errors and possible solutions, please read the following articles:
10-Aug-2019 15:58:37 [ERROR] [Help 1] http://cwiki.apache.org/confluence/display/MAVEN/MojoFailureException
Collapse build WINDOWS Default Stage Download or View
10-Aug-2019 16:06:47 Tests run: 1, Failures: 0, Errors: 0, Skipped: 0, Time elapsed: 0 sec
10-Aug-2019 16:06:47
10-Aug-2019 16:06:47 Results :
10-Aug-2019 16:06:47
10-Aug-2019 16:06:47 Failed tests:   testSetDescriptiveName(org.cip4.printtalk.PurchaseOrderTest): expected:<[Valid]> but was:<[Error]>
10-Aug-2019 16:06:47
10-Aug-2019 16:06:47 Tests run: 124, Failures: 1, Errors: 0, Skipped: 2
10-Aug-2019 16:06:47
10-Aug-2019 16:06:47 [INFO] ------------------------------------------------------------------------
10-Aug-2019 16:06:47 [INFO] BUILD FAILURE
10-Aug-2019 16:06:47 [INFO] ------------------------------------------------------------------------
10-Aug-2019 16:06:47 [INFO] Total time: 01:16 min
10-Aug-2019 16:06:47 [INFO] Finished at: 2019-08-10T16:06:47+02:00
10-Aug-2019 16:06:47 [INFO] Final Memory: 24M/138M
10-Aug-2019 16:06:47 [INFO] ------------------------------------------------------------------------
10-Aug-2019 16:06:47 [ERROR] Failed to execute goal org.apache.maven.plugins:maven-surefire-plugin:2.12.4:test (default-test) on project PrintTalkJ: There are test failures.
10-Aug-2019 16:06:47 [ERROR]
10-Aug-2019 16:06:47 [ERROR] Please refer to D:\bamboo\agent-1\xml-data\build-dir\LIB-PTKJ-WINDOWS\target\surefire-reports for the individual test results.
10-Aug-2019 16:06:47 [ERROR] -> [Help 1]
10-Aug-2019 16:06:47 [ERROR]
10-Aug-2019 16:06:47 [ERROR] To see the full stack trace of the errors, re-run Maven with the -e switch.
10-Aug-2019 16:07:04 [ERROR] Re-run Maven using the -X switch to enable full debug logging.
10-Aug-2019 16:07:04 [ERROR]
10-Aug-2019 16:07:04 [ERROR] For more information about the errors and possible solutions, please read the following articles:
10-Aug-2019 16:07:04 [ERROR] [Help 1] http://cwiki.apache.org/confluence/display/MAVEN/MojoFailureException