Stages & jobs

  1. Default Stage

Build result summary

Details

Completed
Duration
16 seconds
Labels
None
Revision
5316b45adb744b2982972343373a8325d91c9aaa 5316b45adb744b2982972343373a8325d91c9aaa
Total tests
390
Fixed in
#722 (Changes by Rainer Prosi <rainer.prosi@heidelberg.com>)

Responsible

No one has taken responsibility for this failure

Code commits

Author Commit Message Commit date
Rainer Prosi <rainer.prosi@heidelberg.com> Rainer Prosi <rainer.prosi@heidelberg.com> 5316b45adb744b2982972343373a8325d91c9aaa 5316b45adb744b2982972343373a8325d91c9aaa Merge branch 'master' of ssh://bitbucket.cip4.org:7999/lib/printtalkj
Rainer Prosi <rainer.prosi@heidelberg.com> Rainer Prosi <rainer.prosi@heidelberg.com> 32407792b532c0e589a686d8db65890327c93be1 32407792b532c0e589a686d8db65890327c93be1 added mastercontract tests

Tests

New test failures 3
Status Test View job Duration
Collapse Failed MasterContractTest testDescName History
build LINUX < 1 sec
java.lang.ClassCastException: org.cip4.printtalk.PurchaseOrder cannot be cast to org.cip4.printtalk.StockLevelRequest
	at org.cip4.printtalk.MasterContractTest.testDescName(MasterContractTest.java:67)
	at sun.reflect.NativeMethodAccessorImpl.invoke0(Native Method)
	at sun.reflect.NativeMethodAccessorImpl.invoke(NativeMethodAccessorImpl.java:62)
	at sun.reflect.DelegatingMethodAccessorImpl.invoke(DelegatingMethodAccessorImpl.java:43)
	at java.lang.reflect.Method.invoke(Method.java:498)
	at org.junit.runners.model.FrameworkMethod$1.runReflectiveCall(FrameworkMethod.java:47)
	at org.junit.internal.runners.model.ReflectiveCallable.run(ReflectiveCallable.java:12)
(23 more lines...)
Collapse Failed MasterContractTest testDescName History
build MACOSX < 1 sec
java.lang.ClassCastException: org.cip4.printtalk.PurchaseOrder cannot be cast to org.cip4.printtalk.StockLevelRequest
	at org.cip4.printtalk.MasterContractTest.testDescName(MasterContractTest.java:67)
	at sun.reflect.NativeMethodAccessorImpl.invoke0(Native Method)
	at sun.reflect.NativeMethodAccessorImpl.invoke(NativeMethodAccessorImpl.java:62)
	at sun.reflect.DelegatingMethodAccessorImpl.invoke(DelegatingMethodAccessorImpl.java:43)
	at java.lang.reflect.Method.invoke(Method.java:498)
	at org.junit.runners.model.FrameworkMethod$1.runReflectiveCall(FrameworkMethod.java:47)
	at org.junit.internal.runners.model.ReflectiveCallable.run(ReflectiveCallable.java:12)
(23 more lines...)
Collapse Failed MasterContractTest testDescName History
build WINDOWS < 1 sec
java.lang.ClassCastException: org.cip4.printtalk.PurchaseOrder cannot be cast to org.cip4.printtalk.StockLevelRequest
	at org.cip4.printtalk.MasterContractTest.testDescName(MasterContractTest.java:67)
	at sun.reflect.NativeMethodAccessorImpl.invoke0(Native Method)
	at sun.reflect.NativeMethodAccessorImpl.invoke(NativeMethodAccessorImpl.java:62)
	at sun.reflect.DelegatingMethodAccessorImpl.invoke(DelegatingMethodAccessorImpl.java:43)
	at java.lang.reflect.Method.invoke(Method.java:498)
	at org.junit.runners.model.FrameworkMethod$1.runReflectiveCall(FrameworkMethod.java:47)
	at org.junit.internal.runners.model.ReflectiveCallable.run(ReflectiveCallable.java:12)
(23 more lines...)

Shared artifacts

Artifact File size
doc 0 bytes
jar 0 bytes
src 0 bytes