Build: #811 failed

Job: build MACOSX failed

Stages & jobs

  1. Default Stage

Build log

The build generated 699 lines of output. Download or view full build log

23-Apr-2020 18:17:46 Build Libraries - PrintTalkJ - build MACOSX #811 (LIB-PTKJ-MACOSX-811) started building on agent 46.41.56.10 (2)
23-Apr-2020 18:17:46 Remote agent on host 46.41.56.10
23-Apr-2020 18:17:46 Build working directory is /Users/cip4secretariat/Bamboo/bamboo-agent-1/xml-data/build-dir/LIB-PTKJ-MACOSX
23-Apr-2020 18:17:46 Executing build Libraries - PrintTalkJ - build MACOSX #811 (LIB-PTKJ-MACOSX-811)
23-Apr-2020 18:17:46 Starting task 'Checkout' of type 'com.atlassian.bamboo.plugins.vcs:task.vcs.checkout'
23-Apr-2020 18:17:46 Build always requires a clean checkout
23-Apr-2020 18:17:46 Cleaning build directory '/Users/cip4secretariat/Bamboo/bamboo-agent-1/xml-data/build-dir/LIB-PTKJ-MACOSX'
23-Apr-2020 18:17:46 Checking out into /Users/cip4secretariat/Bamboo/bamboo-agent-1/xml-data/build-dir/LIB-PTKJ-MACOSX
23-Apr-2020 18:17:46 Updating source code to revision: 066f2b4cfbc4aa03be0434e25147c8e213edbadc
23-Apr-2020 18:17:46 Creating local git repository in '/Users/cip4secretariat/Bamboo/bamboo-agent-1/xml-data/build-dir/LIB-PTKJ-MACOSX/.git'.
23-Apr-2020 18:17:46 Initialized empty Git repository in /Users/cip4secretariat/Bamboo/bamboo-agent-1/xml-data/build-dir/LIB-PTKJ-MACOSX/.git/
23-Apr-2020 18:17:47 Fetching 'refs/heads/master' from 'ssh://git@bitbucket.cip4.org:7999/lib/printtalkj.git'. Will try to do a shallow fetch.
23-Apr-2020 18:17:47 Warning: Permanently added '[127.0.0.1]:49266' (RSA) to the list of known hosts.
23-Apr-2020 18:17:48 From ssh://127.0.0.1:49266/lib/printtalkj
23-Apr-2020 18:17:48 * [new branch]      master     -> master
23-Apr-2020 18:17:48 Checking out revision 066f2b4cfbc4aa03be0434e25147c8e213edbadc.
23-Apr-2020 18:17:48 Already on 'master'
23-Apr-2020 18:17:48 Updated source code to revision: 066f2b4cfbc4aa03be0434e25147c8e213edbadc
23-Apr-2020 18:17:48 Finished task 'Checkout' with result: Success
23-Apr-2020 18:17:48 Running pre-build action: VCS Version Collector
23-Apr-2020 18:17:48 Starting task 'Test' of type 'com.atlassian.bamboo.plugins.maven:task.builder.mvn3'
23-Apr-2020 18:17:49
Beginning to execute external process for build 'Libraries - PrintTalkJ - build MACOSX #811 (LIB-PTKJ-MACOSX-811)'
... running command line:
/Applications/apache-maven/bin/mvn --batch-mode -Djava.io.tmpdir=/var/folders/wk/5q2_r82n2bdg6xz81xb04hjh0000gn/T/LIB-PTKJ-MACOSX clean test
... in: /Users/cip4secretariat/Bamboo/bamboo-agent-1/xml-data/build-dir/LIB-PTKJ-MACOSX
... using extra environment variables:
bamboo_planRepository_1_branch=master
bamboo_repository_34013192_name=PrintTalkJ master
bamboo_dependency_parent_0=LIB-JDFLIBJ-1517
bamboo_dependency_parent_total=1
bamboo_planRepository_1_branchDisplayName=master
bamboo_repository_34013192_branch_name=master
bamboo_repository_revision_number=066f2b4cfbc4aa03be0434e25147c8e213edbadc
MAVEN2_HOME=/Applications/apache-maven
bamboo_resultsUrl=https://bamboo.cip4.org/browse/LIB-PTKJ-MACOSX-811
bamboo_build_working_directory=/Users/cip4secretariat/Bamboo/bamboo-agent-1/xml-data/build-dir/LIB-PTKJ-MACOSX
bamboo_planRepository_1_name=PrintTalkJ master
bamboo_buildKey=LIB-PTKJ-MACOSX
bamboo_shortPlanName=PrintTalkJ
bamboo_planRepository_name=PrintTalkJ master
bamboo_buildNumber=811
bamboo_capability_system_jdk_JDK_1_8_0_131=/Library/Java/JavaVirtualMachines/jdk1.8.0_131.jdk/Contents/Home/jre
bamboo_shortJobName=build MACOSX
bamboo_buildResultsUrl=https://bamboo.cip4.org/browse/LIB-PTKJ-MACOSX-811
bamboo_repository_34013192_git_repositoryUrl=ssh://git@bitbucket.cip4.org:7999/lib/printtalkj.git
bamboo_planRepository_repositoryUrl=ssh://git@bitbucket.cip4.org:7999/lib/printtalkj.git
bamboo_agentId=33751047
bamboo_planName=Libraries - PrintTalkJ
bamboo_shortPlanKey=PTKJ
bamboo_repository_34013192_previous_revision_number=066f2b4cfbc4aa03be0434e25147c8e213edbadc
bamboo_shortJobKey=MACOSX
bamboo_planRepository_revision=066f2b4cfbc4aa03be0434e25147c8e213edbadc
bamboo_buildTimeStamp=2020-04-23T18:16:37.231+02:00
bamboo_repository_previous_revision_number=066f2b4cfbc4aa03be0434e25147c8e213edbadc
bamboo_planRepository_previousRevision=066f2b4cfbc4aa03be0434e25147c8e213edbadc
M2_HOME=/Applications/apache-maven
bamboo_repository_git_branch=master
bamboo_buildResultKey=LIB-PTKJ-MACOSX-811
bamboo_repository_branch_name=master
bamboo_buildPlanName=Libraries - PrintTalkJ - build MACOSX
bamboo_planRepository_1_revision=066f2b4cfbc4aa03be0434e25147c8e213edbadc
bamboo_repository_name=PrintTalkJ master
JAVA_HOME=/Library/Java/JavaVirtualMachines/jdk1.8.0_131.jdk/Contents/Home/jre
bamboo_repository_34013192_revision_number=066f2b4cfbc4aa03be0434e25147c8e213edbadc
bamboo_buildFailed=false
bamboo_planRepository_branch=master
bamboo_agentWorkingDirectory=/Users/cip4secretariat/Bamboo/bamboo-agent-1/xml-data/build-dir
bamboo_capability_system_git_executable=/usr/bin/git
bamboo_repository_git_username=
bamboo_planRepository_1_previousRevision=066f2b4cfbc4aa03be0434e25147c8e213edbadc
bamboo_planRepository_branchDisplayName=master
bamboo_planRepository_1_type=bbserver
bamboo_planRepository_branchName=master
bamboo_repository_34013192_git_branch=master
bamboo_capability_operating_system_family=unix
bamboo_capability_operating_system_macos=Mac OS X 10.12.6
bamboo_repository_34013192_git_username=
bamboo_capability_system_builder_mvn3_Maven_3_x=/Applications/apache-maven
bamboo_capability_system_jdk_JDK=/Library/Java/JavaVirtualMachines/jdk1.8.0_131.jdk/Contents/Home/jre
bamboo_plan_storageTag=LIB-PTKJ
bamboo_hg_cache_directory=/Users/cip4secretariat/Bamboo/bamboo-agent-1/xml-data/build-dir/_hg-repositories-cache
bamboo_planRepository_1_username=
bamboo_planRepository_type=bbserver
bamboo_git_cache_directory=/Users/cip4secretariat/Bamboo/bamboo-agent-1/xml-data/build-dir/_git-repositories-cache
bamboo_repository_git_repositoryUrl=ssh://git@bitbucket.cip4.org:7999/lib/printtalkj.git
useMavenReturnCode=true
bamboo_tmp_directory=/Users/cip4secretariat/Bamboo/bamboo-agent-1/temp
bamboo_working_directory=/Users/cip4secretariat/Bamboo/bamboo-agent-1/xml-data/build-dir/LIB-PTKJ-MACOSX
bamboo_planKey=LIB-PTKJ
bamboo_planRepository_1_repositoryUrl=ssh://git@bitbucket.cip4.org:7999/lib/printtalkj.git
bamboo_planRepository_username=
bamboo_capability_system_jdk_JDK_1_8=/Library/Java/JavaVirtualMachines/jdk1.8.0_131.jdk/Contents/Home/jre
bamboo_planRepository_1_branchName=master
PATH=/Library/Java/JavaVirtualMachines/jdk1.8.0_131.jdk/Contents/Home/jre/bin:/bin:/usr/bin:/bin:/usr/sbin:/sbin
23-Apr-2020 18:17:50 [INFO] Scanning for projects...
23-Apr-2020 18:17:53 [INFO] Inspecting build with total of 1 modules...
23-Apr-2020 18:17:53 [INFO] Installing Nexus Staging features:
23-Apr-2020 18:17:53 [INFO]   ... total of 1 executions of maven-deploy-plugin replaced with nexus-staging-maven-plugin
23-Apr-2020 18:17:53 [INFO]
23-Apr-2020 18:17:53 [INFO] ------------------------------------------------------------------------
23-Apr-2020 18:17:53 [INFO] Building PrintTalkJ 2.1.6.3-SNAPSHOT
23-Apr-2020 18:17:53 [INFO] ------------------------------------------------------------------------
23-Apr-2020 18:17:54 [INFO] Downloading: https://repo.maven.apache.org/maven2/org/cip4/lib/jdf/JDFLibJ/maven-metadata.xml
23-Apr-2020 18:17:54 [INFO] Downloading: https://oss.sonatype.org/content/repositories/snapshots/org/cip4/lib/jdf/JDFLibJ/maven-metadata.xml
23-Apr-2020 18:17:55 [INFO] Downloaded: https://repo.maven.apache.org/maven2/org/cip4/lib/jdf/JDFLibJ/maven-metadata.xml (712 B at 1.9 kB/s)
23-Apr-2020 18:17:55 [INFO] Downloaded: https://oss.sonatype.org/content/repositories/snapshots/org/cip4/lib/jdf/JDFLibJ/maven-metadata.xml (734 B at 1.2 kB/s)
23-Apr-2020 18:17:55 [INFO] Downloading: https://oss.sonatype.org/content/repositories/snapshots/org/cip4/lib/jdf/JDFLibJ/2.1.6.22-SNAPSHOT/maven-metadata.xml
23-Apr-2020 18:17:55 [INFO] Downloaded: https://oss.sonatype.org/content/repositories/snapshots/org/cip4/lib/jdf/JDFLibJ/2.1.6.22-SNAPSHOT/maven-metadata.xml (2.0 kB at 9.5 kB/s)
23-Apr-2020 18:17:55 [INFO] Downloading: https://oss.sonatype.org/content/repositories/snapshots/org/cip4/lib/jdf/JDFLibJ/2.1.6.22-SNAPSHOT/JDFLibJ-2.1.6.22-20200423.161603-70.pom
23-Apr-2020 18:17:55 [INFO] Downloaded: https://oss.sonatype.org/content/repositories/snapshots/org/cip4/lib/jdf/JDFLibJ/2.1.6.22-SNAPSHOT/JDFLibJ-2.1.6.22-20200423.161603-70.pom (7.9 kB at 37 kB/s)
23-Apr-2020 18:17:56 [INFO] Downloading: https://oss.sonatype.org/content/repositories/snapshots/org/cip4/lib/jdf/JDFLibJ/2.1.6.22-SNAPSHOT/JDFLibJ-2.1.6.22-20200423.161603-70.jar
23-Apr-2020 18:17:57 [INFO] Downloaded: https://oss.sonatype.org/content/repositories/snapshots/org/cip4/lib/jdf/JDFLibJ/2.1.6.22-SNAPSHOT/JDFLibJ-2.1.6.22-20200423.161603-70.jar (4.4 MB at 3.2 MB/s)
23-Apr-2020 18:17:57 [INFO]
23-Apr-2020 18:17:57 [INFO] --- maven-clean-plugin:2.5:clean (default-clean) @ PrintTalkJ ---
23-Apr-2020 18:17:57 [INFO]
23-Apr-2020 18:17:57 [INFO] --- maven-resources-plugin:2.6:resources (default-resources) @ PrintTalkJ ---
23-Apr-2020 18:17:58 [INFO] Using 'UTF-8' encoding to copy filtered resources.
23-Apr-2020 18:17:58 [INFO] skip non existing resourceDirectory /Users/cip4secretariat/Bamboo/bamboo-agent-1/xml-data/build-dir/LIB-PTKJ-MACOSX/src/main/resources
23-Apr-2020 18:17:58 [INFO]
23-Apr-2020 18:17:58 [INFO] --- maven-compiler-plugin:3.0:compile (default-compile) @ PrintTalkJ ---
23-Apr-2020 18:17:59 [INFO] Changes detected - recompiling the module!
23-Apr-2020 18:17:59 [INFO] Compiling 40 source files to /Users/cip4secretariat/Bamboo/bamboo-agent-1/xml-data/build-dir/LIB-PTKJ-MACOSX/target/classes
23-Apr-2020 18:18:01 [WARNING] /Users/cip4secretariat/Bamboo/bamboo-agent-1/xml-data/build-dir/LIB-PTKJ-MACOSX/src/main/java/org/cip4/printtalk/BusinessObject.java: Some input files use or override a deprecated API.
23-Apr-2020 18:18:01 [WARNING] /Users/cip4secretariat/Bamboo/bamboo-agent-1/xml-data/build-dir/LIB-PTKJ-MACOSX/src/main/java/org/cip4/printtalk/BusinessObject.java: Recompile with -Xlint:deprecation for details.
23-Apr-2020 18:18:01 [INFO]
23-Apr-2020 18:18:01 [INFO] --- maven-resources-plugin:2.6:testResources (default-testResources) @ PrintTalkJ ---
23-Apr-2020 18:18:01 [INFO] Using 'UTF-8' encoding to copy filtered resources.
23-Apr-2020 18:18:01 [INFO] Copying 9 resources
23-Apr-2020 18:18:01 [INFO]
23-Apr-2020 18:18:01 [INFO] --- maven-compiler-plugin:3.0:testCompile (default-testCompile) @ PrintTalkJ ---
23-Apr-2020 18:18:01 [INFO] Changes detected - recompiling the module!
23-Apr-2020 18:18:01 [INFO] Compiling 39 source files to /Users/cip4secretariat/Bamboo/bamboo-agent-1/xml-data/build-dir/LIB-PTKJ-MACOSX/target/test-classes
23-Apr-2020 18:18:02 [WARNING] /Users/cip4secretariat/Bamboo/bamboo-agent-1/xml-data/build-dir/LIB-PTKJ-MACOSX/src/test/java/org/cip4/printtalk/PurchaseOrderTest.java: Some input files use or override a deprecated API.
23-Apr-2020 18:18:02 [WARNING] /Users/cip4secretariat/Bamboo/bamboo-agent-1/xml-data/build-dir/LIB-PTKJ-MACOSX/src/test/java/org/cip4/printtalk/PurchaseOrderTest.java: Recompile with -Xlint:deprecation for details.
23-Apr-2020 18:18:02 [INFO]
23-Apr-2020 18:18:02 [INFO] --- maven-surefire-plugin:2.12.4:test (default-test) @ PrintTalkJ ---
23-Apr-2020 18:18:02 [INFO] Surefire report directory: /Users/cip4secretariat/Bamboo/bamboo-agent-1/xml-data/build-dir/LIB-PTKJ-MACOSX/target/surefire-reports
23-Apr-2020 18:18:02
23-Apr-2020 18:18:02 -------------------------------------------------------
23-Apr-2020 18:18:02 T E S T S
23-Apr-2020 18:18:02 -------------------------------------------------------
23-Apr-2020 18:18:03 Running org.cip4.printtalk.AbstractPrintTalkTest
23-Apr-2020 18:18:03 Tests run: 7, Failures: 0, Errors: 0, Skipped: 0, Time elapsed: 0.316 sec
23-Apr-2020 18:18:03 Running org.cip4.printtalk.ArtDeliveryResponseTest
23-Apr-2020 18:18:03 Tests run: 2, Failures: 0, Errors: 0, Skipped: 1, Time elapsed: 0 sec
23-Apr-2020 18:18:03 Running org.cip4.printtalk.ArtDeliveryTest
23-Apr-2020 18:18:03 Tests run: 2, Failures: 0, Errors: 0, Skipped: 1, Time elapsed: 0 sec
23-Apr-2020 18:18:03 Running org.cip4.printtalk.CancellationTest
23-Apr-2020 18:18:03 Tests run: 1, Failures: 0, Errors: 0, Skipped: 0, Time elapsed: 0.48 sec
23-Apr-2020 18:18:03 Running org.cip4.printtalk.ConfirmationTest
23-Apr-2020 18:18:04 Tests run: 1, Failures: 0, Errors: 0, Skipped: 0, Time elapsed: 0.103 sec
23-Apr-2020 18:18:04 Running org.cip4.printtalk.ContentDeliveryResponseTest
23-Apr-2020 18:18:04 Tests run: 4, Failures: 0, Errors: 0, Skipped: 0, Time elapsed: 0.163 sec
23-Apr-2020 18:18:04 Running org.cip4.printtalk.ContentDeliveryTest
23-Apr-2020 18:18:04 Tests run: 3, Failures: 0, Errors: 0, Skipped: 0, Time elapsed: 0.1 sec
23-Apr-2020 18:18:04 Running org.cip4.printtalk.CredentialTest
23-Apr-2020 18:18:04 Tests run: 5, Failures: 0, Errors: 0, Skipped: 0, Time elapsed: 0.018 sec
23-Apr-2020 18:18:04 Running org.cip4.printtalk.CreditCardTest
23-Apr-2020 18:18:04 cc.getExpires: JDFDate[ 2011-09-01T12:00:00+02:00]
23-Apr-2020 18:18:04 Tests run: 1, Failures: 0, Errors: 0, Skipped: 0, Time elapsed: 0.037 sec
23-Apr-2020 18:18:04 Running org.cip4.printtalk.HeaderBaseTest
23-Apr-2020 18:18:04 Tests run: 6, Failures: 0, Errors: 0, Skipped: 0, Time elapsed: 0.015 sec
23-Apr-2020 18:18:04 Running org.cip4.printtalk.HeaderTest
23-Apr-2020 18:18:04 Tests run: 2, Failures: 0, Errors: 0, Skipped: 0, Time elapsed: 0.002 sec
23-Apr-2020 18:18:04 Running org.cip4.printtalk.InvoiceTest
23-Apr-2020 18:18:04 2020-04-23 18:18:04,404 0 [main] INFO org.cip4.printtalk.InvoiceTest  - invoice: <?xml version="1.0" encoding="UTF-8"?>
23-Apr-2020 18:18:04 <Invoice xmlns="http://www.printtalk.org/schema_20" DueDate="2020-04-26T12:00:00+02:00">
23-Apr-2020 18:18:04   <Pricing>
23-Apr-2020 18:18:04     <Price DescriptiveName="Our best price" Price="100"
23-Apr-2020 18:18:04       PriceType="Product" TaxType="Gross"/>
23-Apr-2020 18:18:04   </Pricing>
23-Apr-2020 18:18:04 </Invoice>
23-Apr-2020 18:18:04
23-Apr-2020 18:18:04 Tests run: 4, Failures: 0, Errors: 0, Skipped: 0, Time elapsed: 0.154 sec
23-Apr-2020 18:18:04 Running org.cip4.printtalk.MasterContractTest
23-Apr-2020 18:18:04 Tests run: 4, Failures: 0, Errors: 0, Skipped: 0, Time elapsed: 0.006 sec
23-Apr-2020 18:18:04 Running org.cip4.printtalk.OrderStatusRequestTest
23-Apr-2020 18:18:04 Tests run: 2, Failures: 0, Errors: 0, Skipped: 0, Time elapsed: 0.102 sec
23-Apr-2020 18:18:04 Running org.cip4.printtalk.OrderStatusResponseTest
23-Apr-2020 18:18:04 Tests run: 5, Failures: 0, Errors: 0, Skipped: 0, Time elapsed: 0.149 sec
23-Apr-2020 18:18:04 Running org.cip4.printtalk.PaymentTest
23-Apr-2020 18:18:05 Tests run: 6, Failures: 0, Errors: 0, Skipped: 0, Time elapsed: 0.251 sec
23-Apr-2020 18:18:05 Running org.cip4.printtalk.PriceTest
23-Apr-2020 18:18:05 2020-04-23 18:18:05,103 699 [main] ERROR org.cip4.jdflib.core.XMLErrorHandler  - Parser error: cvc-complex-type.3.2.2: Attribute 'Unit' is not allowed to appear in element 'Price'. src=String
23-Apr-2020 18:18:05 2020-04-23 18:18:05,176 772 [main] ERROR org.cip4.jdflib.core.XMLErrorHandler  - Parser error: cvc-complex-type.4: Attribute 'TaxType' must appear on element 'Price'. src=String
23-Apr-2020 18:18:05 2020-04-23 18:18:05,210 806 [main] ERROR org.cip4.jdflib.core.XMLErrorHandler  - Parser error: cvc-complex-type.4: Attribute 'Price' must appear on element 'Price'. src=String
23-Apr-2020 18:18:05 2020-04-23 18:18:05,244 840 [main] ERROR org.cip4.jdflib.core.XMLErrorHandler  - Parser error: cvc-complex-type.4: Attribute 'PriceType' must appear on element 'Price'. src=String
23-Apr-2020 18:18:05 Tests run: 12, Failures: 0, Errors: 0, Skipped: 0, Time elapsed: 0.196 sec
23-Apr-2020 18:18:05 Running org.cip4.printtalk.PricingTest
23-Apr-2020 18:18:05 Tests run: 4, Failures: 0, Errors: 0, Skipped: 0, Time elapsed: 0.125 sec
23-Apr-2020 18:18:05 Running org.cip4.printtalk.PrintTalkTest
23-Apr-2020 18:18:05 Tests run: 13, Failures: 0, Errors: 0, Skipped: 0, Time elapsed: 0.042 sec
23-Apr-2020 18:18:05 Running org.cip4.printtalk.ProofApprovalRequestTest
23-Apr-2020 18:18:05 Tests run: 2, Failures: 0, Errors: 0, Skipped: 0, Time elapsed: 0.032 sec
23-Apr-2020 18:18:05 Running org.cip4.printtalk.ProofApprovalResponseTest
23-Apr-2020 18:18:05 Tests run: 3, Failures: 0, Errors: 0, Skipped: 0, Time elapsed: 0.067 sec
23-Apr-2020 18:18:05 Running org.cip4.printtalk.PurchaseOrderTest
23-Apr-2020 18:18:05 2020-04-23 18:18:05,590 1186 [main] ERROR org.cip4.jdflib.core.XMLErrorHandler  - Parser error: cvc-complex-type.3.2.2: Attribute 'Version' is not allowed to appear in element 'XJDF'. src=String
23-Apr-2020 18:18:05 2020-04-23 18:18:05,639 1235 [main] ERROR org.cip4.jdflib.core.XMLErrorHandler  - Parser error: cvc-complex-type.3.2.2: Attribute 'Version' is not allowed to appear in element 'XJDF'. src=String
23-Apr-2020 18:18:05 2020-04-23 18:18:05,698 1294 [main] ERROR org.cip4.jdflib.core.XMLErrorHandler  - Parser error: cvc-complex-type.3.2.2: Attribute 'Version' is not allowed to appear in element 'XJDF'. src=String
23-Apr-2020 18:18:05 2020-04-23 18:18:05,731 1327 [main] ERROR org.cip4.jdflib.core.XMLErrorHandler  - Parser error: cvc-complex-type.3.2.2: Attribute 'Version' is not allowed to appear in element 'XJDF'. src=String
23-Apr-2020 18:18:05 Tests run: 10, Failures: 4, Errors: 0, Skipped: 0, Time elapsed: 0.229 sec <<< FAILURE!
23-Apr-2020 18:18:05 testReorderID(org.cip4.printtalk.PurchaseOrderTest)  Time elapsed: 0.056 sec  <<< FAILURE!
23-Apr-2020 18:18:05 org.junit.ComparisonFailure: expected:<[Valid]> but was:<[Error]>
23-Apr-2020 18:18:05         at org.junit.Assert.assertEquals(Assert.java:115)
23-Apr-2020 18:18:05         at org.junit.Assert.assertEquals(Assert.java:144)
23-Apr-2020 18:18:05         at org.cip4.printtalk.PrintTalkTestCase.reparse(PrintTalkTestCase.java:217)
23-Apr-2020 18:18:05         at org.cip4.printtalk.PrintTalkTestCase.reparse(PrintTalkTestCase.java:181)
23-Apr-2020 18:18:05         at org.cip4.printtalk.PurchaseOrderTest.testReorderID(PurchaseOrderTest.java:128)
23-Apr-2020 18:18:05         at sun.reflect.NativeMethodAccessorImpl.invoke0(Native Method)
23-Apr-2020 18:18:05         at sun.reflect.NativeMethodAccessorImpl.invoke(NativeMethodAccessorImpl.java:62)
23-Apr-2020 18:18:05         at sun.reflect.DelegatingMethodAccessorImpl.invoke(DelegatingMethodAccessorImpl.java:43)
23-Apr-2020 18:18:05         at java.lang.reflect.Method.invoke(Method.java:498)
23-Apr-2020 18:18:05         at org.junit.runners.model.FrameworkMethod$1.runReflectiveCall(FrameworkMethod.java:47)
23-Apr-2020 18:18:05         at org.junit.internal.runners.model.ReflectiveCallable.run(ReflectiveCallable.java:12)
23-Apr-2020 18:18:05         at org.junit.runners.model.FrameworkMethod.invokeExplosively(FrameworkMethod.java:44)
23-Apr-2020 18:18:05         at org.junit.internal.runners.statements.InvokeMethod.evaluate(InvokeMethod.java:17)
23-Apr-2020 18:18:05         at org.junit.internal.runners.statements.RunBefores.evaluate(RunBefores.java:26)
23-Apr-2020 18:18:05         at org.junit.internal.runners.statements.RunAfters.evaluate(RunAfters.java:27)
23-Apr-2020 18:18:05         at org.junit.runners.ParentRunner.runLeaf(ParentRunner.java:271)
23-Apr-2020 18:18:05         at org.junit.runners.BlockJUnit4ClassRunner.runChild(BlockJUnit4ClassRunner.java:70)
23-Apr-2020 18:18:05         at org.junit.runners.BlockJUnit4ClassRunner.runChild(BlockJUnit4ClassRunner.java:50)
23-Apr-2020 18:18:05         at org.junit.runners.ParentRunner$3.run(ParentRunner.java:238)
23-Apr-2020 18:18:05         at org.junit.runners.ParentRunner$1.schedule(ParentRunner.java:63)
23-Apr-2020 18:18:05         at org.junit.runners.ParentRunner.runChildren(ParentRunner.java:236)
23-Apr-2020 18:18:05         at org.junit.runners.ParentRunner.access$000(ParentRunner.java:53)
23-Apr-2020 18:18:05         at org.junit.runners.ParentRunner$2.evaluate(ParentRunner.java:229)
23-Apr-2020 18:18:05         at org.junit.runners.ParentRunner.run(ParentRunner.java:309)
23-Apr-2020 18:18:05         at org.apache.maven.surefire.junit4.JUnit4Provider.execute(JUnit4Provider.java:252)
23-Apr-2020 18:18:05         at org.apache.maven.surefire.junit4.JUnit4Provider.executeTestSet(JUnit4Provider.java:141)
23-Apr-2020 18:18:05         at org.apache.maven.surefire.junit4.JUnit4Provider.invoke(JUnit4Provider.java:112)
23-Apr-2020 18:18:05         at sun.reflect.NativeMethodAccessorImpl.invoke0(Native Method)
23-Apr-2020 18:18:05         at sun.reflect.NativeMethodAccessorImpl.invoke(NativeMethodAccessorImpl.java:62)
23-Apr-2020 18:18:05         at sun.reflect.DelegatingMethodAccessorImpl.invoke(DelegatingMethodAccessorImpl.java:43)
23-Apr-2020 18:18:05         at java.lang.reflect.Method.invoke(Method.java:498)
23-Apr-2020 18:18:05         at org.apache.maven.surefire.util.ReflectionUtils.invokeMethodWithArray(ReflectionUtils.java:189)
23-Apr-2020 18:18:05         at org.apache.maven.surefire.booter.ProviderFactory$ProviderProxy.invoke(ProviderFactory.java:165)
23-Apr-2020 18:18:05         at org.apache.maven.surefire.booter.ProviderFactory.invokeProvider(ProviderFactory.java:85)
23-Apr-2020 18:18:05         at org.apache.maven.surefire.booter.ForkedBooter.runSuitesInProcess(ForkedBooter.java:115)
23-Apr-2020 18:18:05         at org.apache.maven.surefire.booter.ForkedBooter.main(ForkedBooter.java:75)
23-Apr-2020 18:18:05
23-Apr-2020 18:18:05 testSetDescriptiveName(org.cip4.printtalk.PurchaseOrderTest)  Time elapsed: 0.045 sec  <<< FAILURE!
23-Apr-2020 18:18:05 org.junit.ComparisonFailure: expected:<[Valid]> but was:<[Error]>
23-Apr-2020 18:18:05         at org.junit.Assert.assertEquals(Assert.java:115)
23-Apr-2020 18:18:05         at org.junit.Assert.assertEquals(Assert.java:144)
23-Apr-2020 18:18:05         at org.cip4.printtalk.PrintTalkTestCase.reparse(PrintTalkTestCase.java:217)
23-Apr-2020 18:18:05         at org.cip4.printtalk.PrintTalkTestCase.reparse(PrintTalkTestCase.java:181)
23-Apr-2020 18:18:05         at org.cip4.printtalk.PurchaseOrderTest.testSetDescriptiveName(PurchaseOrderTest.java:88)
23-Apr-2020 18:18:05         at sun.reflect.NativeMethodAccessorImpl.invoke0(Native Method)
23-Apr-2020 18:18:05         at sun.reflect.NativeMethodAccessorImpl.invoke(NativeMethodAccessorImpl.java:62)
23-Apr-2020 18:18:05         at sun.reflect.DelegatingMethodAccessorImpl.invoke(DelegatingMethodAccessorImpl.java:43)
23-Apr-2020 18:18:05         at java.lang.reflect.Method.invoke(Method.java:498)
23-Apr-2020 18:18:05         at org.junit.runners.model.FrameworkMethod$1.runReflectiveCall(FrameworkMethod.java:47)
23-Apr-2020 18:18:05         at org.junit.internal.runners.model.ReflectiveCallable.run(ReflectiveCallable.java:12)
23-Apr-2020 18:18:05         at org.junit.runners.model.FrameworkMethod.invokeExplosively(FrameworkMethod.java:44)
23-Apr-2020 18:18:05         at org.junit.internal.runners.statements.InvokeMethod.evaluate(InvokeMethod.java:17)
23-Apr-2020 18:18:05         at org.junit.internal.runners.statements.RunBefores.evaluate(RunBefores.java:26)
23-Apr-2020 18:18:05         at org.junit.internal.runners.statements.RunAfters.evaluate(RunAfters.java:27)
23-Apr-2020 18:18:05         at org.junit.runners.ParentRunner.runLeaf(ParentRunner.java:271)
23-Apr-2020 18:18:05         at org.junit.runners.BlockJUnit4ClassRunner.runChild(BlockJUnit4ClassRunner.java:70)
23-Apr-2020 18:18:05         at org.junit.runners.BlockJUnit4ClassRunner.runChild(BlockJUnit4ClassRunner.java:50)
23-Apr-2020 18:18:05         at org.junit.runners.ParentRunner$3.run(ParentRunner.java:238)
23-Apr-2020 18:18:05         at org.junit.runners.ParentRunner$1.schedule(ParentRunner.java:63)
23-Apr-2020 18:18:05         at org.junit.runners.ParentRunner.runChildren(ParentRunner.java:236)
23-Apr-2020 18:18:05         at org.junit.runners.ParentRunner.access$000(ParentRunner.java:53)
23-Apr-2020 18:18:05         at org.junit.runners.ParentRunner$2.evaluate(ParentRunner.java:229)
23-Apr-2020 18:18:05         at org.junit.runners.ParentRunner.run(ParentRunner.java:309)
23-Apr-2020 18:18:05         at org.apache.maven.surefire.junit4.JUnit4Provider.execute(JUnit4Provider.java:252)
23-Apr-2020 18:18:05         at org.apache.maven.surefire.junit4.JUnit4Provider.executeTestSet(JUnit4Provider.java:141)
23-Apr-2020 18:18:05         at org.apache.maven.surefire.junit4.JUnit4Provider.invoke(JUnit4Provider.java:112)
23-Apr-2020 18:18:05         at sun.reflect.NativeMethodAccessorImpl.invoke0(Native Method)
23-Apr-2020 18:18:05         at sun.reflect.NativeMethodAccessorImpl.invoke(NativeMethodAccessorImpl.java:62)
23-Apr-2020 18:18:05         at sun.reflect.DelegatingMethodAccessorImpl.invoke(DelegatingMethodAccessorImpl.java:43)
23-Apr-2020 18:18:05         at java.lang.reflect.Method.invoke(Method.java:498)
23-Apr-2020 18:18:05         at org.apache.maven.surefire.util.ReflectionUtils.invokeMethodWithArray(ReflectionUtils.java:189)
23-Apr-2020 18:18:05         at org.apache.maven.surefire.booter.ProviderFactory$ProviderProxy.invoke(ProviderFactory.java:165)
23-Apr-2020 18:18:05         at org.apache.maven.surefire.booter.ProviderFactory.invokeProvider(ProviderFactory.java:85)
23-Apr-2020 18:18:05         at org.apache.maven.surefire.booter.ForkedBooter.runSuitesInProcess(ForkedBooter.java:115)
23-Apr-2020 18:18:05         at org.apache.maven.surefire.booter.ForkedBooter.main(ForkedBooter.java:75)
23-Apr-2020 18:18:05
23-Apr-2020 18:18:05 testQuoteID(org.cip4.printtalk.PurchaseOrderTest)  Time elapsed: 0.05 sec  <<< FAILURE!
23-Apr-2020 18:18:05 org.junit.ComparisonFailure: expected:<[Valid]> but was:<[Error]>
23-Apr-2020 18:18:05         at org.junit.Assert.assertEquals(Assert.java:115)
23-Apr-2020 18:18:05         at org.junit.Assert.assertEquals(Assert.java:144)
23-Apr-2020 18:18:05         at org.cip4.printtalk.PrintTalkTestCase.reparse(PrintTalkTestCase.java:217)
23-Apr-2020 18:18:05         at org.cip4.printtalk.PrintTalkTestCase.reparse(PrintTalkTestCase.java:181)
23-Apr-2020 18:18:05         at org.cip4.printtalk.PurchaseOrderTest.testQuoteID(PurchaseOrderTest.java:108)
23-Apr-2020 18:18:05         at sun.reflect.NativeMethodAccessorImpl.invoke0(Native Method)
23-Apr-2020 18:18:05         at sun.reflect.NativeMethodAccessorImpl.invoke(NativeMethodAccessorImpl.java:62)
23-Apr-2020 18:18:05         at sun.reflect.DelegatingMethodAccessorImpl.invoke(DelegatingMethodAccessorImpl.java:43)
23-Apr-2020 18:18:05         at java.lang.reflect.Method.invoke(Method.java:498)
23-Apr-2020 18:18:05         at org.junit.runners.model.FrameworkMethod$1.runReflectiveCall(FrameworkMethod.java:47)
23-Apr-2020 18:18:05         at org.junit.internal.runners.model.ReflectiveCallable.run(ReflectiveCallable.java:12)
23-Apr-2020 18:18:05         at org.junit.runners.model.FrameworkMethod.invokeExplosively(FrameworkMethod.java:44)
23-Apr-2020 18:18:05         at org.junit.internal.runners.statements.InvokeMethod.evaluate(InvokeMethod.java:17)
23-Apr-2020 18:18:05         at org.junit.internal.runners.statements.RunBefores.evaluate(RunBefores.java:26)
23-Apr-2020 18:18:05         at org.junit.internal.runners.statements.RunAfters.evaluate(RunAfters.java:27)
23-Apr-2020 18:18:05         at org.junit.runners.ParentRunner.runLeaf(ParentRunner.java:271)
23-Apr-2020 18:18:05         at org.junit.runners.BlockJUnit4ClassRunner.runChild(BlockJUnit4ClassRunner.java:70)
23-Apr-2020 18:18:05         at org.junit.runners.BlockJUnit4ClassRunner.runChild(BlockJUnit4ClassRunner.java:50)
23-Apr-2020 18:18:05         at org.junit.runners.ParentRunner$3.run(ParentRunner.java:238)
23-Apr-2020 18:18:05         at org.junit.runners.ParentRunner$1.schedule(ParentRunner.java:63)
23-Apr-2020 18:18:05         at org.junit.runners.ParentRunner.runChildren(ParentRunner.java:236)
23-Apr-2020 18:18:05         at org.junit.runners.ParentRunner.access$000(ParentRunner.java:53)
23-Apr-2020 18:18:05         at org.junit.runners.ParentRunner$2.evaluate(ParentRunner.java:229)
23-Apr-2020 18:18:05         at org.junit.runners.ParentRunner.run(ParentRunner.java:309)
23-Apr-2020 18:18:05         at org.apache.maven.surefire.junit4.JUnit4Provider.execute(JUnit4Provider.java:252)
23-Apr-2020 18:18:05         at org.apache.maven.surefire.junit4.JUnit4Provider.executeTestSet(JUnit4Provider.java:141)
23-Apr-2020 18:18:05         at org.apache.maven.surefire.junit4.JUnit4Provider.invoke(JUnit4Provider.java:112)
23-Apr-2020 18:18:05         at sun.reflect.NativeMethodAccessorImpl.invoke0(Native Method)
23-Apr-2020 18:18:05         at sun.reflect.NativeMethodAccessorImpl.invoke(NativeMethodAccessorImpl.java:62)
23-Apr-2020 18:18:05         at sun.reflect.DelegatingMethodAccessorImpl.invoke(DelegatingMethodAccessorImpl.java:43)
23-Apr-2020 18:18:05         at java.lang.reflect.Method.invoke(Method.java:498)
23-Apr-2020 18:18:05         at org.apache.maven.surefire.util.ReflectionUtils.invokeMethodWithArray(ReflectionUtils.java:189)
23-Apr-2020 18:18:05         at org.apache.maven.surefire.booter.ProviderFactory$ProviderProxy.invoke(ProviderFactory.java:165)
23-Apr-2020 18:18:05         at org.apache.maven.surefire.booter.ProviderFactory.invokeProvider(ProviderFactory.java:85)
23-Apr-2020 18:18:05         at org.apache.maven.surefire.booter.ForkedBooter.runSuitesInProcess(ForkedBooter.java:115)
23-Apr-2020 18:18:05         at org.apache.maven.surefire.booter.ForkedBooter.main(ForkedBooter.java:75)
23-Apr-2020 18:18:05
23-Apr-2020 18:18:05 testComment(org.cip4.printtalk.PurchaseOrderTest)  Time elapsed: 0.033 sec  <<< FAILURE!
23-Apr-2020 18:18:05 org.junit.ComparisonFailure: expected:<[Valid]> but was:<[Error]>
23-Apr-2020 18:18:05         at org.junit.Assert.assertEquals(Assert.java:115)
23-Apr-2020 18:18:05         at org.junit.Assert.assertEquals(Assert.java:144)
23-Apr-2020 18:18:05         at org.cip4.printtalk.PrintTalkTestCase.reparse(PrintTalkTestCase.java:217)
23-Apr-2020 18:18:05         at org.cip4.printtalk.PrintTalkTestCase.reparse(PrintTalkTestCase.java:181)
23-Apr-2020 18:18:05         at org.cip4.printtalk.PurchaseOrderTest.testComment(PurchaseOrderTest.java:148)
23-Apr-2020 18:18:05         at sun.reflect.NativeMethodAccessorImpl.invoke0(Native Method)
23-Apr-2020 18:18:05         at sun.reflect.NativeMethodAccessorImpl.invoke(NativeMethodAccessorImpl.java:62)
23-Apr-2020 18:18:05         at sun.reflect.DelegatingMethodAccessorImpl.invoke(DelegatingMethodAccessorImpl.java:43)
23-Apr-2020 18:18:05         at java.lang.reflect.Method.invoke(Method.java:498)
23-Apr-2020 18:18:05         at org.junit.runners.model.FrameworkMethod$1.runReflectiveCall(FrameworkMethod.java:47)
23-Apr-2020 18:18:05         at org.junit.internal.runners.model.ReflectiveCallable.run(ReflectiveCallable.java:12)
23-Apr-2020 18:18:05         at org.junit.runners.model.FrameworkMethod.invokeExplosively(FrameworkMethod.java:44)
23-Apr-2020 18:18:05         at org.junit.internal.runners.statements.InvokeMethod.evaluate(InvokeMethod.java:17)
23-Apr-2020 18:18:05         at org.junit.internal.runners.statements.RunBefores.evaluate(RunBefores.java:26)
23-Apr-2020 18:18:05         at org.junit.internal.runners.statements.RunAfters.evaluate(RunAfters.java:27)
23-Apr-2020 18:18:05         at org.junit.runners.ParentRunner.runLeaf(ParentRunner.java:271)
23-Apr-2020 18:18:05         at org.junit.runners.BlockJUnit4ClassRunner.runChild(BlockJUnit4ClassRunner.java:70)
23-Apr-2020 18:18:05         at org.junit.runners.BlockJUnit4ClassRunner.runChild(BlockJUnit4ClassRunner.java:50)
23-Apr-2020 18:18:05         at org.junit.runners.ParentRunner$3.run(ParentRunner.java:238)
23-Apr-2020 18:18:05         at org.junit.runners.ParentRunner$1.schedule(ParentRunner.java:63)
23-Apr-2020 18:18:05         at org.junit.runners.ParentRunner.runChildren(ParentRunner.java:236)
23-Apr-2020 18:18:05         at org.junit.runners.ParentRunner.access$000(ParentRunner.java:53)
23-Apr-2020 18:18:05         at org.junit.runners.ParentRunner$2.evaluate(ParentRunner.java:229)
23-Apr-2020 18:18:05         at org.junit.runners.ParentRunner.run(ParentRunner.java:309)
23-Apr-2020 18:18:05         at org.apache.maven.surefire.junit4.JUnit4Provider.execute(JUnit4Provider.java:252)
23-Apr-2020 18:18:05         at org.apache.maven.surefire.junit4.JUnit4Provider.executeTestSet(JUnit4Provider.java:141)
23-Apr-2020 18:18:05         at org.apache.maven.surefire.junit4.JUnit4Provider.invoke(JUnit4Provider.java:112)
23-Apr-2020 18:18:05         at sun.reflect.NativeMethodAccessorImpl.invoke0(Native Method)
23-Apr-2020 18:18:05         at sun.reflect.NativeMethodAccessorImpl.invoke(NativeMethodAccessorImpl.java:62)
23-Apr-2020 18:18:05         at sun.reflect.DelegatingMethodAccessorImpl.invoke(DelegatingMethodAccessorImpl.java:43)
23-Apr-2020 18:18:05         at java.lang.reflect.Method.invoke(Method.java:498)
23-Apr-2020 18:18:05         at org.apache.maven.surefire.util.ReflectionUtils.invokeMethodWithArray(ReflectionUtils.java:189)
23-Apr-2020 18:18:05         at org.apache.maven.surefire.booter.ProviderFactory$ProviderProxy.invoke(ProviderFactory.java:165)
23-Apr-2020 18:18:05         at org.apache.maven.surefire.booter.ProviderFactory.invokeProvider(ProviderFactory.java:85)
23-Apr-2020 18:18:05         at org.apache.maven.surefire.booter.ForkedBooter.runSuitesInProcess(ForkedBooter.java:115)
23-Apr-2020 18:18:05         at org.apache.maven.surefire.booter.ForkedBooter.main(ForkedBooter.java:75)
23-Apr-2020 18:18:05
23-Apr-2020 18:18:05 Running org.cip4.printtalk.QuotationTest
23-Apr-2020 18:18:05 Tests run: 7, Failures: 0, Errors: 0, Skipped: 0, Time elapsed: 0.025 sec
23-Apr-2020 18:18:05 Running org.cip4.printtalk.QuoteTest
23-Apr-2020 18:18:05 2020-04-23 18:18:05,841 1437 [main] ERROR org.cip4.jdflib.core.XMLErrorHandler  - Parser error: cvc-complex-type.4: Attribute 'Currency' must appear on element 'Pricing'. src=String
23-Apr-2020 18:18:05 Tests run: 7, Failures: 0, Errors: 0, Skipped: 0, Time elapsed: 0.079 sec
23-Apr-2020 18:18:05 Running org.cip4.printtalk.RFQTest
23-Apr-2020 18:18:05 2020-04-23 18:18:05,901 1497 [main] ERROR org.cip4.jdflib.core.XMLErrorHandler  - Parser error: cvc-complex-type.3.2.2: Attribute 'Version' is not allowed to appear in element 'XJDF'. src=String
23-Apr-2020 18:18:05 2020-04-23 18:18:05,902 1498 [main] ERROR org.cip4.jdflib.core.XMLErrorHandler  - Parser error: cvc-complex-type.3.2.2: Attribute 'Version' is not allowed to appear in element 'XJDF'. src=String
23-Apr-2020 18:18:05 2020-04-23 18:18:05,940 1536 [main] ERROR org.cip4.jdflib.core.XMLErrorHandler  - Parser error: cvc-pattern-valid: Value '€' is not facet-valid with respect to pattern '[A-Z][A-Z][A-Z]' for type 'Currency'. src=String
23-Apr-2020 18:18:05 2020-04-23 18:18:05,940 1536 [main] ERROR org.cip4.jdflib.core.XMLErrorHandler  - Parser error: cvc-attribute.3: The value '€' of attribute 'Currency' on element 'RFQ' is not valid with respect to its type, 'Currency'. src=String
23-Apr-2020 18:18:05 2020-04-23 18:18:05,941 1537 [main] ERROR org.cip4.jdflib.core.XMLErrorHandler  - Parser error: cvc-complex-type.3.2.2: Attribute 'Version' is not allowed to appear in element 'XJDF'. src=String
23-Apr-2020 18:18:05 2020-04-23 18:18:05,971 1567 [main] ERROR org.cip4.jdflib.core.XMLErrorHandler  - Parser error: cvc-complex-type.3.2.2: Attribute 'Version' is not allowed to appear in element 'XJDF'. src=String
23-Apr-2020 18:18:06 2020-04-23 18:18:06,008 1604 [main] ERROR org.cip4.jdflib.core.XMLErrorHandler  - Parser error: cvc-complex-type.3.2.2: Attribute 'Version' is not allowed to appear in element 'XJDF'. src=String
23-Apr-2020 18:18:06 2020-04-23 18:18:06,072 1668 [main] ERROR org.cip4.jdflib.core.XMLErrorHandler  - Parser error: cvc-complex-type.3.2.2: Attribute 'Version' is not allowed to appear in element 'XJDF'. src=String
23-Apr-2020 18:18:06 2020-04-23 18:18:06,219 1815 [main] ERROR org.cip4.jdflib.core.XMLErrorHandler  - Parser error: cvc-complex-type.3.2.2: Attribute 'Version' is not allowed to appear in element 'XJDF'. src=String
23-Apr-2020 18:18:06 Tests run: 9, Failures: 5, Errors: 0, Skipped: 0, Time elapsed: 0.359 sec <<< FAILURE!
23-Apr-2020 18:18:06 testappendXJDF(org.cip4.printtalk.RFQTest)  Time elapsed: 0.033 sec  <<< FAILURE!
23-Apr-2020 18:18:06 org.junit.ComparisonFailure: expected:<[Valid]> but was:<[Error]>
23-Apr-2020 18:18:06         at org.junit.Assert.assertEquals(Assert.java:115)
23-Apr-2020 18:18:06         at org.junit.Assert.assertEquals(Assert.java:144)
23-Apr-2020 18:18:06         at org.cip4.printtalk.PrintTalkTestCase.reparse(PrintTalkTestCase.java:217)
23-Apr-2020 18:18:06         at org.cip4.printtalk.PrintTalkTestCase.reparse(PrintTalkTestCase.java:181)
23-Apr-2020 18:18:06         at org.cip4.printtalk.RFQTest.testappendXJDF(RFQTest.java:188)
23-Apr-2020 18:18:06         at sun.reflect.NativeMethodAccessorImpl.invoke0(Native Method)
23-Apr-2020 18:18:06         at sun.reflect.NativeMethodAccessorImpl.invoke(NativeMethodAccessorImpl.java:62)
23-Apr-2020 18:18:06         at sun.reflect.DelegatingMethodAccessorImpl.invoke(DelegatingMethodAccessorImpl.java:43)
23-Apr-2020 18:18:06         at java.lang.reflect.Method.invoke(Method.java:498)
23-Apr-2020 18:18:06         at org.junit.runners.model.FrameworkMethod$1.runReflectiveCall(FrameworkMethod.java:47)
23-Apr-2020 18:18:06         at org.junit.internal.runners.model.ReflectiveCallable.run(ReflectiveCallable.java:12)
23-Apr-2020 18:18:06         at org.junit.runners.model.FrameworkMethod.invokeExplosively(FrameworkMethod.java:44)
23-Apr-2020 18:18:06         at org.junit.internal.runners.statements.InvokeMethod.evaluate(InvokeMethod.java:17)
23-Apr-2020 18:18:06         at org.junit.internal.runners.statements.RunBefores.evaluate(RunBefores.java:26)
23-Apr-2020 18:18:06         at org.junit.internal.runners.statements.RunAfters.evaluate(RunAfters.java:27)
23-Apr-2020 18:18:06         at org.junit.runners.ParentRunner.runLeaf(ParentRunner.java:271)
23-Apr-2020 18:18:06         at org.junit.runners.BlockJUnit4ClassRunner.runChild(BlockJUnit4ClassRunner.java:70)
23-Apr-2020 18:18:06         at org.junit.runners.BlockJUnit4ClassRunner.runChild(BlockJUnit4ClassRunner.java:50)
23-Apr-2020 18:18:06         at org.junit.runners.ParentRunner$3.run(ParentRunner.java:238)
23-Apr-2020 18:18:06         at org.junit.runners.ParentRunner$1.schedule(ParentRunner.java:63)
23-Apr-2020 18:18:06         at org.junit.runners.ParentRunner.runChildren(ParentRunner.java:236)
23-Apr-2020 18:18:06         at org.junit.runners.ParentRunner.access$000(ParentRunner.java:53)
23-Apr-2020 18:18:06         at org.junit.runners.ParentRunner$2.evaluate(ParentRunner.java:229)
23-Apr-2020 18:18:06         at org.junit.runners.ParentRunner.run(ParentRunner.java:309)
23-Apr-2020 18:18:06         at org.apache.maven.surefire.junit4.JUnit4Provider.execute(JUnit4Provider.java:252)
23-Apr-2020 18:18:06         at org.apache.maven.surefire.junit4.JUnit4Provider.executeTestSet(JUnit4Provider.java:141)
23-Apr-2020 18:18:06         at org.apache.maven.surefire.junit4.JUnit4Provider.invoke(JUnit4Provider.java:112)
23-Apr-2020 18:18:06         at sun.reflect.NativeMethodAccessorImpl.invoke0(Native Method)
23-Apr-2020 18:18:06         at sun.reflect.NativeMethodAccessorImpl.invoke(NativeMethodAccessorImpl.java:62)
23-Apr-2020 18:18:06         at sun.reflect.DelegatingMethodAccessorImpl.invoke(DelegatingMethodAccessorImpl.java:43)
23-Apr-2020 18:18:06         at java.lang.reflect.Method.invoke(Method.java:498)
23-Apr-2020 18:18:06         at org.apache.maven.surefire.util.ReflectionUtils.invokeMethodWithArray(ReflectionUtils.java:189)
23-Apr-2020 18:18:06         at org.apache.maven.surefire.booter.ProviderFactory$ProviderProxy.invoke(ProviderFactory.java:165)
23-Apr-2020 18:18:06         at org.apache.maven.surefire.booter.ProviderFactory.invokeProvider(ProviderFactory.java:85)
23-Apr-2020 18:18:06         at org.apache.maven.surefire.booter.ForkedBooter.runSuitesInProcess(ForkedBooter.java:115)
23-Apr-2020 18:18:06         at org.apache.maven.surefire.booter.ForkedBooter.main(ForkedBooter.java:75)
23-Apr-2020 18:18:06
23-Apr-2020 18:18:06 testCurrency(org.cip4.printtalk.RFQTest)  Time elapsed: 0.03 sec  <<< FAILURE!
23-Apr-2020 18:18:06 org.junit.ComparisonFailure: expected:<[Valid]> but was:<[Error]>
23-Apr-2020 18:18:06         at org.junit.Assert.assertEquals(Assert.java:115)
23-Apr-2020 18:18:06         at org.junit.Assert.assertEquals(Assert.java:144)
23-Apr-2020 18:18:06         at org.cip4.printtalk.PrintTalkTestCase.reparse(PrintTalkTestCase.java:217)
23-Apr-2020 18:18:06         at org.cip4.printtalk.PrintTalkTestCase.reparse(PrintTalkTestCase.java:181)
23-Apr-2020 18:18:06         at org.cip4.printtalk.RFQTest.testCurrency(RFQTest.java:115)
23-Apr-2020 18:18:06         at sun.reflect.NativeMethodAccessorImpl.invoke0(Native Method)
23-Apr-2020 18:18:06         at sun.reflect.NativeMethodAccessorImpl.invoke(NativeMethodAccessorImpl.java:62)
23-Apr-2020 18:18:06         at sun.reflect.DelegatingMethodAccessorImpl.invoke(DelegatingMethodAccessorImpl.java:43)
23-Apr-2020 18:18:06         at java.lang.reflect.Method.invoke(Method.java:498)
23-Apr-2020 18:18:06         at org.junit.runners.model.FrameworkMethod$1.runReflectiveCall(FrameworkMethod.java:47)
23-Apr-2020 18:18:06         at org.junit.internal.runners.model.ReflectiveCallable.run(ReflectiveCallable.java:12)
23-Apr-2020 18:18:06         at org.junit.runners.model.FrameworkMethod.invokeExplosively(FrameworkMethod.java:44)
23-Apr-2020 18:18:06         at org.junit.internal.runners.statements.InvokeMethod.evaluate(InvokeMethod.java:17)
23-Apr-2020 18:18:06         at org.junit.internal.runners.statements.RunBefores.evaluate(RunBefores.java:26)
23-Apr-2020 18:18:06         at org.junit.internal.runners.statements.RunAfters.evaluate(RunAfters.java:27)
23-Apr-2020 18:18:06         at org.junit.runners.ParentRunner.runLeaf(ParentRunner.java:271)
23-Apr-2020 18:18:06         at org.junit.runners.BlockJUnit4ClassRunner.runChild(BlockJUnit4ClassRunner.java:70)
23-Apr-2020 18:18:06         at org.junit.runners.BlockJUnit4ClassRunner.runChild(BlockJUnit4ClassRunner.java:50)
23-Apr-2020 18:18:06         at org.junit.runners.ParentRunner$3.run(ParentRunner.java:238)
23-Apr-2020 18:18:06         at org.junit.runners.ParentRunner$1.schedule(ParentRunner.java:63)
23-Apr-2020 18:18:06         at org.junit.runners.ParentRunner.runChildren(ParentRunner.java:236)
23-Apr-2020 18:18:06         at org.junit.runners.ParentRunner.access$000(ParentRunner.java:53)
23-Apr-2020 18:18:06         at org.junit.runners.ParentRunner$2.evaluate(ParentRunner.java:229)
23-Apr-2020 18:18:06         at org.junit.runners.ParentRunner.run(ParentRunner.java:309)
23-Apr-2020 18:18:06         at org.apache.maven.surefire.junit4.JUnit4Provider.execute(JUnit4Provider.java:252)
23-Apr-2020 18:18:06         at org.apache.maven.surefire.junit4.JUnit4Provider.executeTestSet(JUnit4Provider.java:141)
23-Apr-2020 18:18:06         at org.apache.maven.surefire.junit4.JUnit4Provider.invoke(JUnit4Provider.java:112)
23-Apr-2020 18:18:06         at sun.reflect.NativeMethodAccessorImpl.invoke0(Native Method)
23-Apr-2020 18:18:06         at sun.reflect.NativeMethodAccessorImpl.invoke(NativeMethodAccessorImpl.java:62)
23-Apr-2020 18:18:06         at sun.reflect.DelegatingMethodAccessorImpl.invoke(DelegatingMethodAccessorImpl.java:43)
23-Apr-2020 18:18:06         at java.lang.reflect.Method.invoke(Method.java:498)
23-Apr-2020 18:18:06         at org.apache.maven.surefire.util.ReflectionUtils.invokeMethodWithArray(ReflectionUtils.java:189)
23-Apr-2020 18:18:06         at org.apache.maven.surefire.booter.ProviderFactory$ProviderProxy.invoke(ProviderFactory.java:165)
23-Apr-2020 18:18:06         at org.apache.maven.surefire.booter.ProviderFactory.invokeProvider(ProviderFactory.java:85)
23-Apr-2020 18:18:06         at org.apache.maven.surefire.booter.ForkedBooter.runSuitesInProcess(ForkedBooter.java:115)
23-Apr-2020 18:18:06         at org.apache.maven.surefire.booter.ForkedBooter.main(ForkedBooter.java:75)
23-Apr-2020 18:18:06
23-Apr-2020 18:18:06 testsetExpiresDays(org.cip4.printtalk.RFQTest)  Time elapsed: 0.078 sec  <<< FAILURE!
23-Apr-2020 18:18:06 org.junit.ComparisonFailure: expected:<[Valid]> but was:<[Error]>
23-Apr-2020 18:18:06         at org.junit.Assert.assertEquals(Assert.java:115)
23-Apr-2020 18:18:06         at org.junit.Assert.assertEquals(Assert.java:144)
23-Apr-2020 18:18:06         at org.cip4.printtalk.PrintTalkTestCase.reparse(PrintTalkTestCase.java:217)
23-Apr-2020 18:18:06         at org.cip4.printtalk.PrintTalkTestCase.reparse(PrintTalkTestCase.java:181)
23-Apr-2020 18:18:06         at org.cip4.printtalk.RFQTest.testsetExpiresDays(RFQTest.java:99)
23-Apr-2020 18:18:06         at sun.reflect.NativeMethodAccessorImpl.invoke0(Native Method)
23-Apr-2020 18:18:06         at sun.reflect.NativeMethodAccessorImpl.invoke(NativeMethodAccessorImpl.java:62)
23-Apr-2020 18:18:06         at sun.reflect.DelegatingMethodAccessorImpl.invoke(DelegatingMethodAccessorImpl.java:43)
23-Apr-2020 18:18:06         at java.lang.reflect.Method.invoke(Method.java:498)
23-Apr-2020 18:18:06         at org.junit.runners.model.FrameworkMethod$1.runReflectiveCall(FrameworkMethod.java:47)
23-Apr-2020 18:18:06         at org.junit.internal.runners.model.ReflectiveCallable.run(ReflectiveCallable.java:12)
23-Apr-2020 18:18:06         at org.junit.runners.model.FrameworkMethod.invokeExplosively(FrameworkMethod.java:44)
23-Apr-2020 18:18:06         at org.junit.internal.runners.statements.InvokeMethod.evaluate(InvokeMethod.java:17)
23-Apr-2020 18:18:06         at org.junit.internal.runners.statements.RunBefores.evaluate(RunBefores.java:26)
23-Apr-2020 18:18:06         at org.junit.internal.runners.statements.RunAfters.evaluate(RunAfters.java:27)
23-Apr-2020 18:18:06         at org.junit.runners.ParentRunner.runLeaf(ParentRunner.java:271)
23-Apr-2020 18:18:06         at org.junit.runners.BlockJUnit4ClassRunner.runChild(BlockJUnit4ClassRunner.java:70)
23-Apr-2020 18:18:06         at org.junit.runners.BlockJUnit4ClassRunner.runChild(BlockJUnit4ClassRunner.java:50)
23-Apr-2020 18:18:06         at org.junit.runners.ParentRunner$3.run(ParentRunner.java:238)
23-Apr-2020 18:18:06         at org.junit.runners.ParentRunner$1.schedule(ParentRunner.java:63)
23-Apr-2020 18:18:06         at org.junit.runners.ParentRunner.runChildren(ParentRunner.java:236)
23-Apr-2020 18:18:06         at org.junit.runners.ParentRunner.access$000(ParentRunner.java:53)
23-Apr-2020 18:18:06         at org.junit.runners.ParentRunner$2.evaluate(ParentRunner.java:229)
23-Apr-2020 18:18:06         at org.junit.runners.ParentRunner.run(ParentRunner.java:309)
23-Apr-2020 18:18:06         at org.apache.maven.surefire.junit4.JUnit4Provider.execute(JUnit4Provider.java:252)
23-Apr-2020 18:18:06         at org.apache.maven.surefire.junit4.JUnit4Provider.executeTestSet(JUnit4Provider.java:141)
23-Apr-2020 18:18:06         at org.apache.maven.surefire.junit4.JUnit4Provider.invoke(JUnit4Provider.java:112)
23-Apr-2020 18:18:06         at sun.reflect.NativeMethodAccessorImpl.invoke0(Native Method)
23-Apr-2020 18:18:06         at sun.reflect.NativeMethodAccessorImpl.invoke(NativeMethodAccessorImpl.java:62)
23-Apr-2020 18:18:06         at sun.reflect.DelegatingMethodAccessorImpl.invoke(DelegatingMethodAccessorImpl.java:43)
23-Apr-2020 18:18:06         at java.lang.reflect.Method.invoke(Method.java:498)
23-Apr-2020 18:18:06         at org.apache.maven.surefire.util.ReflectionUtils.invokeMethodWithArray(ReflectionUtils.java:189)
23-Apr-2020 18:18:06         at org.apache.maven.surefire.booter.ProviderFactory$ProviderProxy.invoke(ProviderFactory.java:165)
23-Apr-2020 18:18:06         at org.apache.maven.surefire.booter.ProviderFactory.invokeProvider(ProviderFactory.java:85)
23-Apr-2020 18:18:06         at org.apache.maven.surefire.booter.ForkedBooter.runSuitesInProcess(ForkedBooter.java:115)
23-Apr-2020 18:18:06         at org.apache.maven.surefire.booter.ForkedBooter.main(ForkedBooter.java:75)
23-Apr-2020 18:18:06
23-Apr-2020 18:18:06 testAmountPrices(org.cip4.printtalk.RFQTest)  Time elapsed: 0.137 sec  <<< FAILURE!
23-Apr-2020 18:18:06 org.junit.ComparisonFailure: expected:<[Valid]> but was:<[Error]>
23-Apr-2020 18:18:06         at org.junit.Assert.assertEquals(Assert.java:115)
23-Apr-2020 18:18:06         at org.junit.Assert.assertEquals(Assert.java:144)
23-Apr-2020 18:18:06         at org.cip4.printtalk.PrintTalkTestCase.reparse(PrintTalkTestCase.java:217)
23-Apr-2020 18:18:06         at org.cip4.printtalk.PrintTalkTestCase.reparse(PrintTalkTestCase.java:181)
23-Apr-2020 18:18:06         at org.cip4.printtalk.RFQTest.testAmountPrices(RFQTest.java:151)
23-Apr-2020 18:18:06         at sun.reflect.NativeMethodAccessorImpl.invoke0(Native Method)
23-Apr-2020 18:18:06         at sun.reflect.NativeMethodAccessorImpl.invoke(NativeMethodAccessorImpl.java:62)
23-Apr-2020 18:18:06         at sun.reflect.DelegatingMethodAccessorImpl.invoke(DelegatingMethodAccessorImpl.java:43)
23-Apr-2020 18:18:06         at java.lang.reflect.Method.invoke(Method.java:498)
23-Apr-2020 18:18:06         at org.junit.runners.model.FrameworkMethod$1.runReflectiveCall(FrameworkMethod.java:47)
23-Apr-2020 18:18:06         at org.junit.internal.runners.model.ReflectiveCallable.run(ReflectiveCallable.java:12)
23-Apr-2020 18:18:06         at org.junit.runners.model.FrameworkMethod.invokeExplosively(FrameworkMethod.java:44)
23-Apr-2020 18:18:06         at org.junit.internal.runners.statements.InvokeMethod.evaluate(InvokeMethod.java:17)
23-Apr-2020 18:18:06         at org.junit.internal.runners.statements.RunBefores.evaluate(RunBefores.java:26)
23-Apr-2020 18:18:06         at org.junit.internal.runners.statements.RunAfters.evaluate(RunAfters.java:27)
23-Apr-2020 18:18:06         at org.junit.runners.ParentRunner.runLeaf(ParentRunner.java:271)
23-Apr-2020 18:18:06         at org.junit.runners.BlockJUnit4ClassRunner.runChild(BlockJUnit4ClassRunner.java:70)
23-Apr-2020 18:18:06         at org.junit.runners.BlockJUnit4ClassRunner.runChild(BlockJUnit4ClassRunner.java:50)
23-Apr-2020 18:18:06         at org.junit.runners.ParentRunner$3.run(ParentRunner.java:238)
23-Apr-2020 18:18:06         at org.junit.runners.ParentRunner$1.schedule(ParentRunner.java:63)
23-Apr-2020 18:18:06         at org.junit.runners.ParentRunner.runChildren(ParentRunner.java:236)
23-Apr-2020 18:18:06         at org.junit.runners.ParentRunner.access$000(ParentRunner.java:53)
23-Apr-2020 18:18:06         at org.junit.runners.ParentRunner$2.evaluate(ParentRunner.java:229)
23-Apr-2020 18:18:06         at org.junit.runners.ParentRunner.run(ParentRunner.java:309)
23-Apr-2020 18:18:06         at org.apache.maven.surefire.junit4.JUnit4Provider.execute(JUnit4Provider.java:252)
23-Apr-2020 18:18:06         at org.apache.maven.surefire.junit4.JUnit4Provider.executeTestSet(JUnit4Provider.java:141)
23-Apr-2020 18:18:06         at org.apache.maven.surefire.junit4.JUnit4Provider.invoke(JUnit4Provider.java:112)
23-Apr-2020 18:18:06         at sun.reflect.NativeMethodAccessorImpl.invoke0(Native Method)
23-Apr-2020 18:18:06         at sun.reflect.NativeMethodAccessorImpl.invoke(NativeMethodAccessorImpl.java:62)
23-Apr-2020 18:18:06         at sun.reflect.DelegatingMethodAccessorImpl.invoke(DelegatingMethodAccessorImpl.java:43)
23-Apr-2020 18:18:06         at java.lang.reflect.Method.invoke(Method.java:498)
23-Apr-2020 18:18:06         at org.apache.maven.surefire.util.ReflectionUtils.invokeMethodWithArray(ReflectionUtils.java:189)
23-Apr-2020 18:18:06         at org.apache.maven.surefire.booter.ProviderFactory$ProviderProxy.invoke(ProviderFactory.java:165)
23-Apr-2020 18:18:06         at org.apache.maven.surefire.booter.ProviderFactory.invokeProvider(ProviderFactory.java:85)
23-Apr-2020 18:18:06         at org.apache.maven.surefire.booter.ForkedBooter.runSuitesInProcess(ForkedBooter.java:115)
23-Apr-2020 18:18:06         at org.apache.maven.surefire.booter.ForkedBooter.main(ForkedBooter.java:75)
23-Apr-2020 18:18:06
23-Apr-2020 18:18:06 testMasterContract(org.cip4.printtalk.RFQTest)  Time elapsed: 0.036 sec  <<< FAILURE!
23-Apr-2020 18:18:06 org.junit.ComparisonFailure: expected:<[Valid]> but was:<[Error]>
23-Apr-2020 18:18:06         at org.junit.Assert.assertEquals(Assert.java:115)
23-Apr-2020 18:18:06         at org.junit.Assert.assertEquals(Assert.java:144)
23-Apr-2020 18:18:06         at org.cip4.printtalk.PrintTalkTestCase.reparse(PrintTalkTestCase.java:217)
23-Apr-2020 18:18:06         at org.cip4.printtalk.PrintTalkTestCase.reparse(PrintTalkTestCase.java:181)
23-Apr-2020 18:18:06         at org.cip4.printtalk.RFQTest.testMasterContract(RFQTest.java:132)
23-Apr-2020 18:18:06         at sun.reflect.NativeMethodAccessorImpl.invoke0(Native Method)
23-Apr-2020 18:18:06         at sun.reflect.NativeMethodAccessorImpl.invoke(NativeMethodAccessorImpl.java:62)
23-Apr-2020 18:18:06         at sun.reflect.DelegatingMethodAccessorImpl.invoke(DelegatingMethodAccessorImpl.java:43)
23-Apr-2020 18:18:06         at java.lang.reflect.Method.invoke(Method.java:498)
23-Apr-2020 18:18:06         at org.junit.runners.model.FrameworkMethod$1.runReflectiveCall(FrameworkMethod.java:47)
23-Apr-2020 18:18:06         at org.junit.internal.runners.model.ReflectiveCallable.run(ReflectiveCallable.java:12)
23-Apr-2020 18:18:06         at org.junit.runners.model.FrameworkMethod.invokeExplosively(FrameworkMethod.java:44)
23-Apr-2020 18:18:06         at org.junit.internal.runners.statements.InvokeMethod.evaluate(InvokeMethod.java:17)
23-Apr-2020 18:18:06         at org.junit.internal.runners.statements.RunBefores.evaluate(RunBefores.java:26)
23-Apr-2020 18:18:06         at org.junit.internal.runners.statements.RunAfters.evaluate(RunAfters.java:27)
23-Apr-2020 18:18:06         at org.junit.runners.ParentRunner.runLeaf(ParentRunner.java:271)
23-Apr-2020 18:18:06         at org.junit.runners.BlockJUnit4ClassRunner.runChild(BlockJUnit4ClassRunner.java:70)
23-Apr-2020 18:18:06         at org.junit.runners.BlockJUnit4ClassRunner.runChild(BlockJUnit4ClassRunner.java:50)
23-Apr-2020 18:18:06         at org.junit.runners.ParentRunner$3.run(ParentRunner.java:238)
23-Apr-2020 18:18:06         at org.junit.runners.ParentRunner$1.schedule(ParentRunner.java:63)
23-Apr-2020 18:18:06         at org.junit.runners.ParentRunner.runChildren(ParentRunner.java:236)
23-Apr-2020 18:18:06         at org.junit.runners.ParentRunner.access$000(ParentRunner.java:53)
23-Apr-2020 18:18:06         at org.junit.runners.ParentRunner$2.evaluate(ParentRunner.java:229)
23-Apr-2020 18:18:06         at org.junit.runners.ParentRunner.run(ParentRunner.java:309)
23-Apr-2020 18:18:06         at org.apache.maven.surefire.junit4.JUnit4Provider.execute(JUnit4Provider.java:252)
23-Apr-2020 18:18:06         at org.apache.maven.surefire.junit4.JUnit4Provider.executeTestSet(JUnit4Provider.java:141)
23-Apr-2020 18:18:06         at org.apache.maven.surefire.junit4.JUnit4Provider.invoke(JUnit4Provider.java:112)
23-Apr-2020 18:18:06         at sun.reflect.NativeMethodAccessorImpl.invoke0(Native Method)
23-Apr-2020 18:18:06         at sun.reflect.NativeMethodAccessorImpl.invoke(NativeMethodAccessorImpl.java:62)
23-Apr-2020 18:18:06         at sun.reflect.DelegatingMethodAccessorImpl.invoke(DelegatingMethodAccessorImpl.java:43)
23-Apr-2020 18:18:06         at java.lang.reflect.Method.invoke(Method.java:498)
23-Apr-2020 18:18:06         at org.apache.maven.surefire.util.ReflectionUtils.invokeMethodWithArray(ReflectionUtils.java:189)
23-Apr-2020 18:18:06         at org.apache.maven.surefire.booter.ProviderFactory$ProviderProxy.invoke(ProviderFactory.java:165)
23-Apr-2020 18:18:06         at org.apache.maven.surefire.booter.ProviderFactory.invokeProvider(ProviderFactory.java:85)
23-Apr-2020 18:18:06         at org.apache.maven.surefire.booter.ForkedBooter.runSuitesInProcess(ForkedBooter.java:115)
23-Apr-2020 18:18:06         at org.apache.maven.surefire.booter.ForkedBooter.main(ForkedBooter.java:75)
23-Apr-2020 18:18:06
23-Apr-2020 18:18:06 Running org.cip4.printtalk.RefusalTest
23-Apr-2020 18:18:06 Tests run: 4, Failures: 0, Errors: 0, Skipped: 0, Time elapsed: 0.025 sec
23-Apr-2020 18:18:06 Running org.cip4.printtalk.ReturnJobTest
23-Apr-2020 18:18:06 Tests run: 4, Failures: 0, Errors: 0, Skipped: 0, Time elapsed: 0.007 sec
23-Apr-2020 18:18:06 Running org.cip4.printtalk.StatusRequestTest
23-Apr-2020 18:18:06 Tests run: 3, Failures: 0, Errors: 0, Skipped: 0, Time elapsed: 0.034 sec
23-Apr-2020 18:18:06 Running org.cip4.printtalk.StockLevelRequestTest
23-Apr-2020 18:18:06 Tests run: 4, Failures: 0, Errors: 0, Skipped: 0, Time elapsed: 0.061 sec
23-Apr-2020 18:18:06 Running org.cip4.printtalk.StockLevelResponseTest
23-Apr-2020 18:18:06 2020-04-23 18:18:06,416 2012 [main] ERROR org.cip4.jdflib.core.XMLErrorHandler  - Parser error: cvc-complex-type.3.2.2: Attribute 'Version' is not allowed to appear in element 'XJDF'. src=String
23-Apr-2020 18:18:06 2020-04-23 18:18:06,417 2013 [main] ERROR org.cip4.jdflib.core.XMLErrorHandler  - Parser error: cvc-complex-type.3.2.2: Attribute 'Version' is not allowed to appear in element 'XJDF'. src=String
23-Apr-2020 18:18:06 2020-04-23 18:18:06,417 2013 [main] ERROR org.cip4.jdflib.core.XMLErrorHandler  - Parser error: cvc-complex-type.3.2.2: Attribute 'Version' is not allowed to appear in element 'XJDF'. src=String
23-Apr-2020 18:18:06 2020-04-23 18:18:06,418 2014 [main] ERROR org.cip4.jdflib.core.XMLErrorHandler  - Parser error: cvc-complex-type.3.2.2: Attribute 'Version' is not allowed to appear in element 'XJDF'. src=String
23-Apr-2020 18:18:06 2020-04-23 18:18:06,418 2014 [main] ERROR org.cip4.jdflib.core.XMLErrorHandler  - Parser error: cvc-complex-type.3.2.2: Attribute 'Version' is not allowed to appear in element 'XJDF'. src=String
23-Apr-2020 18:18:06 2020-04-23 18:18:06,418 2014 [main] ERROR org.cip4.jdflib.core.XMLErrorHandler  - Parser error: cvc-complex-type.3.2.2: Attribute 'Version' is not allowed to appear in element 'XJDF'. src=String
23-Apr-2020 18:18:06 2020-04-23 18:18:06,419 2015 [main] ERROR org.cip4.jdflib.core.XMLErrorHandler  - Parser error: cvc-complex-type.3.2.2: Attribute 'Version' is not allowed to appear in element 'XJDF'. src=String
23-Apr-2020 18:18:06 2020-04-23 18:18:06,443 2039 [main] ERROR org.cip4.jdflib.core.XMLErrorHandler  - Parser error: cvc-complex-type.3.2.2: Attribute 'Version' is not allowed to appear in element 'XJDF'. src=String
23-Apr-2020 18:18:06 2020-04-23 18:18:06,444 2040 [main] ERROR org.cip4.jdflib.core.XMLErrorHandler  - Parser error: cvc-complex-type.3.2.2: Attribute 'Version' is not allowed to appear in element 'XJDF'. src=String
23-Apr-2020 18:18:06 2020-04-23 18:18:06,444 2040 [main] ERROR org.cip4.jdflib.core.XMLErrorHandler  - Parser error: cvc-complex-type.3.2.2: Attribute 'Version' is not allowed to appear in element 'XJDF'. src=String
23-Apr-2020 18:18:06 Tests run: 2, Failures: 2, Errors: 0, Skipped: 0, Time elapsed: 0.051 sec <<< FAILURE!
23-Apr-2020 18:18:06 testMatchesAvailability(org.cip4.printtalk.StockLevelResponseTest)  Time elapsed: 0.026 sec  <<< FAILURE!
23-Apr-2020 18:18:06 org.junit.ComparisonFailure: expected:<[Valid]> but was:<[Error]>
23-Apr-2020 18:18:06         at org.junit.Assert.assertEquals(Assert.java:115)
23-Apr-2020 18:18:06         at org.junit.Assert.assertEquals(Assert.java:144)
23-Apr-2020 18:18:06         at org.cip4.printtalk.PrintTalkTestCase.reparse(PrintTalkTestCase.java:217)
23-Apr-2020 18:18:06         at org.cip4.printtalk.PrintTalkTestCase.reparse(PrintTalkTestCase.java:181)
23-Apr-2020 18:18:06         at org.cip4.printtalk.StockLevelResponseTest.testMatchesAvailability(StockLevelResponseTest.java:98)
23-Apr-2020 18:18:06         at sun.reflect.NativeMethodAccessorImpl.invoke0(Native Method)
23-Apr-2020 18:18:06         at sun.reflect.NativeMethodAccessorImpl.invoke(NativeMethodAccessorImpl.java:62)
23-Apr-2020 18:18:06         at sun.reflect.DelegatingMethodAccessorImpl.invoke(DelegatingMethodAccessorImpl.java:43)
23-Apr-2020 18:18:06         at java.lang.reflect.Method.invoke(Method.java:498)
23-Apr-2020 18:18:06         at org.junit.runners.model.FrameworkMethod$1.runReflectiveCall(FrameworkMethod.java:47)
23-Apr-2020 18:18:06         at org.junit.internal.runners.model.ReflectiveCallable.run(ReflectiveCallable.java:12)
23-Apr-2020 18:18:06         at org.junit.runners.model.FrameworkMethod.invokeExplosively(FrameworkMethod.java:44)
23-Apr-2020 18:18:06         at org.junit.internal.runners.statements.InvokeMethod.evaluate(InvokeMethod.java:17)
23-Apr-2020 18:18:06         at org.junit.internal.runners.statements.RunBefores.evaluate(RunBefores.java:26)
23-Apr-2020 18:18:06         at org.junit.internal.runners.statements.RunAfters.evaluate(RunAfters.java:27)
23-Apr-2020 18:18:06         at org.junit.runners.ParentRunner.runLeaf(ParentRunner.java:271)
23-Apr-2020 18:18:06         at org.junit.runners.BlockJUnit4ClassRunner.runChild(BlockJUnit4ClassRunner.java:70)
23-Apr-2020 18:18:06         at org.junit.runners.BlockJUnit4ClassRunner.runChild(BlockJUnit4ClassRunner.java:50)
23-Apr-2020 18:18:06         at org.junit.runners.ParentRunner$3.run(ParentRunner.java:238)
23-Apr-2020 18:18:06         at org.junit.runners.ParentRunner$1.schedule(ParentRunner.java:63)
23-Apr-2020 18:18:06         at org.junit.runners.ParentRunner.runChildren(ParentRunner.java:236)
23-Apr-2020 18:18:06         at org.junit.runners.ParentRunner.access$000(ParentRunner.java:53)
23-Apr-2020 18:18:06         at org.junit.runners.ParentRunner$2.evaluate(ParentRunner.java:229)
23-Apr-2020 18:18:06         at org.junit.runners.ParentRunner.run(ParentRunner.java:309)
23-Apr-2020 18:18:06         at org.apache.maven.surefire.junit4.JUnit4Provider.execute(JUnit4Provider.java:252)
23-Apr-2020 18:18:06         at org.apache.maven.surefire.junit4.JUnit4Provider.executeTestSet(JUnit4Provider.java:141)
23-Apr-2020 18:18:06         at org.apache.maven.surefire.junit4.JUnit4Provider.invoke(JUnit4Provider.java:112)
23-Apr-2020 18:18:06         at sun.reflect.NativeMethodAccessorImpl.invoke0(Native Method)
23-Apr-2020 18:18:06         at sun.reflect.NativeMethodAccessorImpl.invoke(NativeMethodAccessorImpl.java:62)
23-Apr-2020 18:18:06         at sun.reflect.DelegatingMethodAccessorImpl.invoke(DelegatingMethodAccessorImpl.java:43)
23-Apr-2020 18:18:06         at java.lang.reflect.Method.invoke(Method.java:498)
23-Apr-2020 18:18:06         at org.apache.maven.surefire.util.ReflectionUtils.invokeMethodWithArray(ReflectionUtils.java:189)
23-Apr-2020 18:18:06         at org.apache.maven.surefire.booter.ProviderFactory$ProviderProxy.invoke(ProviderFactory.java:165)
23-Apr-2020 18:18:06         at org.apache.maven.surefire.booter.ProviderFactory.invokeProvider(ProviderFactory.java:85)
23-Apr-2020 18:18:06         at org.apache.maven.surefire.booter.ForkedBooter.runSuitesInProcess(ForkedBooter.java:115)
23-Apr-2020 18:18:06         at org.apache.maven.surefire.booter.ForkedBooter.main(ForkedBooter.java:75)
23-Apr-2020 18:18:06
23-Apr-2020 18:18:06 testMasterContract(org.cip4.printtalk.StockLevelResponseTest)  Time elapsed: 0.025 sec  <<< FAILURE!
23-Apr-2020 18:18:06 org.junit.ComparisonFailure: expected:<[Valid]> but was:<[Error]>
23-Apr-2020 18:18:06         at org.junit.Assert.assertEquals(Assert.java:115)
23-Apr-2020 18:18:06         at org.junit.Assert.assertEquals(Assert.java:144)
23-Apr-2020 18:18:06         at org.cip4.printtalk.PrintTalkTestCase.reparse(PrintTalkTestCase.java:217)
23-Apr-2020 18:18:06         at org.cip4.printtalk.PrintTalkTestCase.reparse(PrintTalkTestCase.java:181)
23-Apr-2020 18:18:06         at org.cip4.printtalk.StockLevelResponseTest.testMasterContract(StockLevelResponseTest.java:122)
23-Apr-2020 18:18:06         at sun.reflect.NativeMethodAccessorImpl.invoke0(Native Method)
23-Apr-2020 18:18:06         at sun.reflect.NativeMethodAccessorImpl.invoke(NativeMethodAccessorImpl.java:62)
23-Apr-2020 18:18:06         at sun.reflect.DelegatingMethodAccessorImpl.invoke(DelegatingMethodAccessorImpl.java:43)
23-Apr-2020 18:18:06         at java.lang.reflect.Method.invoke(Method.java:498)
23-Apr-2020 18:18:06         at org.junit.runners.model.FrameworkMethod$1.runReflectiveCall(FrameworkMethod.java:47)
23-Apr-2020 18:18:06         at org.junit.internal.runners.model.ReflectiveCallable.run(ReflectiveCallable.java:12)
23-Apr-2020 18:18:06         at org.junit.runners.model.FrameworkMethod.invokeExplosively(FrameworkMethod.java:44)
23-Apr-2020 18:18:06         at org.junit.internal.runners.statements.InvokeMethod.evaluate(InvokeMethod.java:17)
23-Apr-2020 18:18:06         at org.junit.internal.runners.statements.RunBefores.evaluate(RunBefores.java:26)
23-Apr-2020 18:18:06         at org.junit.internal.runners.statements.RunAfters.evaluate(RunAfters.java:27)
23-Apr-2020 18:18:06         at org.junit.runners.ParentRunner.runLeaf(ParentRunner.java:271)
23-Apr-2020 18:18:06         at org.junit.runners.BlockJUnit4ClassRunner.runChild(BlockJUnit4ClassRunner.java:70)
23-Apr-2020 18:18:06         at org.junit.runners.BlockJUnit4ClassRunner.runChild(BlockJUnit4ClassRunner.java:50)
23-Apr-2020 18:18:06         at org.junit.runners.ParentRunner$3.run(ParentRunner.java:238)
23-Apr-2020 18:18:06         at org.junit.runners.ParentRunner$1.schedule(ParentRunner.java:63)
23-Apr-2020 18:18:06         at org.junit.runners.ParentRunner.runChildren(ParentRunner.java:236)
23-Apr-2020 18:18:06         at org.junit.runners.ParentRunner.access$000(ParentRunner.java:53)
23-Apr-2020 18:18:06         at org.junit.runners.ParentRunner$2.evaluate(ParentRunner.java:229)
23-Apr-2020 18:18:06         at org.junit.runners.ParentRunner.run(ParentRunner.java:309)
23-Apr-2020 18:18:06         at org.apache.maven.surefire.junit4.JUnit4Provider.execute(JUnit4Provider.java:252)
23-Apr-2020 18:18:06         at org.apache.maven.surefire.junit4.JUnit4Provider.executeTestSet(JUnit4Provider.java:141)
23-Apr-2020 18:18:06         at org.apache.maven.surefire.junit4.JUnit4Provider.invoke(JUnit4Provider.java:112)
23-Apr-2020 18:18:06         at sun.reflect.NativeMethodAccessorImpl.invoke0(Native Method)
23-Apr-2020 18:18:06         at sun.reflect.NativeMethodAccessorImpl.invoke(NativeMethodAccessorImpl.java:62)
23-Apr-2020 18:18:06         at sun.reflect.DelegatingMethodAccessorImpl.invoke(DelegatingMethodAccessorImpl.java:43)
23-Apr-2020 18:18:06         at java.lang.reflect.Method.invoke(Method.java:498)
23-Apr-2020 18:18:06         at org.apache.maven.surefire.util.ReflectionUtils.invokeMethodWithArray(ReflectionUtils.java:189)
23-Apr-2020 18:18:06         at org.apache.maven.surefire.booter.ProviderFactory$ProviderProxy.invoke(ProviderFactory.java:165)
23-Apr-2020 18:18:06         at org.apache.maven.surefire.booter.ProviderFactory.invokeProvider(ProviderFactory.java:85)
23-Apr-2020 18:18:06         at org.apache.maven.surefire.booter.ForkedBooter.runSuitesInProcess(ForkedBooter.java:115)
23-Apr-2020 18:18:06         at org.apache.maven.surefire.booter.ForkedBooter.main(ForkedBooter.java:75)
23-Apr-2020 18:18:06
23-Apr-2020 18:18:06 Running org.cip4.printtalk.StockLevelTest
23-Apr-2020 18:18:06 2020-04-23 18:18:06,471 2067 [main] ERROR org.cip4.jdflib.core.XMLErrorHandler  - Parser error: cvc-complex-type.3.2.2: Attribute 'Version' is not allowed to appear in element 'XJDF'. src=String
23-Apr-2020 18:18:06 Tests run: 2, Failures: 1, Errors: 0, Skipped: 0, Time elapsed: 0.025 sec <<< FAILURE!
23-Apr-2020 18:18:06 testComplete(org.cip4.printtalk.StockLevelTest)  Time elapsed: 0.024 sec  <<< FAILURE!
23-Apr-2020 18:18:06 org.junit.ComparisonFailure: expected:<[Valid]> but was:<[Error]>
23-Apr-2020 18:18:06         at org.junit.Assert.assertEquals(Assert.java:115)
23-Apr-2020 18:18:06         at org.junit.Assert.assertEquals(Assert.java:144)
23-Apr-2020 18:18:06         at org.cip4.printtalk.PrintTalkTestCase.reparse(PrintTalkTestCase.java:217)
23-Apr-2020 18:18:06         at org.cip4.printtalk.PrintTalkTestCase.reparse(PrintTalkTestCase.java:181)
23-Apr-2020 18:18:06         at org.cip4.printtalk.StockLevelTest.testComplete(StockLevelTest.java:89)
23-Apr-2020 18:18:06         at sun.reflect.NativeMethodAccessorImpl.invoke0(Native Method)
23-Apr-2020 18:18:06         at sun.reflect.NativeMethodAccessorImpl.invoke(NativeMethodAccessorImpl.java:62)
23-Apr-2020 18:18:06         at sun.reflect.DelegatingMethodAccessorImpl.invoke(DelegatingMethodAccessorImpl.java:43)
23-Apr-2020 18:18:06         at java.lang.reflect.Method.invoke(Method.java:498)
23-Apr-2020 18:18:06         at org.junit.runners.model.FrameworkMethod$1.runReflectiveCall(FrameworkMethod.java:47)
23-Apr-2020 18:18:06         at org.junit.internal.runners.model.ReflectiveCallable.run(ReflectiveCallable.java:12)
23-Apr-2020 18:18:06         at org.junit.runners.model.FrameworkMethod.invokeExplosively(FrameworkMethod.java:44)
23-Apr-2020 18:18:06         at org.junit.internal.runners.statements.InvokeMethod.evaluate(InvokeMethod.java:17)
23-Apr-2020 18:18:06         at org.junit.internal.runners.statements.RunBefores.evaluate(RunBefores.java:26)
23-Apr-2020 18:18:06         at org.junit.internal.runners.statements.RunAfters.evaluate(RunAfters.java:27)
23-Apr-2020 18:18:06         at org.junit.runners.ParentRunner.runLeaf(ParentRunner.java:271)
23-Apr-2020 18:18:06         at org.junit.runners.BlockJUnit4ClassRunner.runChild(BlockJUnit4ClassRunner.java:70)
23-Apr-2020 18:18:06         at org.junit.runners.BlockJUnit4ClassRunner.runChild(BlockJUnit4ClassRunner.java:50)
23-Apr-2020 18:18:06         at org.junit.runners.ParentRunner$3.run(ParentRunner.java:238)
23-Apr-2020 18:18:06         at org.junit.runners.ParentRunner$1.schedule(ParentRunner.java:63)
23-Apr-2020 18:18:06         at org.junit.runners.ParentRunner.runChildren(ParentRunner.java:236)
23-Apr-2020 18:18:06         at org.junit.runners.ParentRunner.access$000(ParentRunner.java:53)
23-Apr-2020 18:18:06         at org.junit.runners.ParentRunner$2.evaluate(ParentRunner.java:229)
23-Apr-2020 18:18:06         at org.junit.runners.ParentRunner.run(ParentRunner.java:309)
23-Apr-2020 18:18:06         at org.apache.maven.surefire.junit4.JUnit4Provider.execute(JUnit4Provider.java:252)
23-Apr-2020 18:18:06         at org.apache.maven.surefire.junit4.JUnit4Provider.executeTestSet(JUnit4Provider.java:141)
23-Apr-2020 18:18:06         at org.apache.maven.surefire.junit4.JUnit4Provider.invoke(JUnit4Provider.java:112)
23-Apr-2020 18:18:06         at sun.reflect.NativeMethodAccessorImpl.invoke0(Native Method)
23-Apr-2020 18:18:06         at sun.reflect.NativeMethodAccessorImpl.invoke(NativeMethodAccessorImpl.java:62)
23-Apr-2020 18:18:06         at sun.reflect.DelegatingMethodAccessorImpl.invoke(DelegatingMethodAccessorImpl.java:43)
23-Apr-2020 18:18:06         at java.lang.reflect.Method.invoke(Method.java:498)
23-Apr-2020 18:18:06         at org.apache.maven.surefire.util.ReflectionUtils.invokeMethodWithArray(ReflectionUtils.java:189)
23-Apr-2020 18:18:06         at org.apache.maven.surefire.booter.ProviderFactory$ProviderProxy.invoke(ProviderFactory.java:165)
23-Apr-2020 18:18:06         at org.apache.maven.surefire.booter.ProviderFactory.invokeProvider(ProviderFactory.java:85)
23-Apr-2020 18:18:06         at org.apache.maven.surefire.booter.ForkedBooter.runSuitesInProcess(ForkedBooter.java:115)
23-Apr-2020 18:18:06         at org.apache.maven.surefire.booter.ForkedBooter.main(ForkedBooter.java:75)
23-Apr-2020 18:18:06
23-Apr-2020 18:18:06 Running org.cip4.printtalk.builder.PrintTalkBuilderFactoryTest
23-Apr-2020 18:18:06 Tests run: 5, Failures: 0, Errors: 0, Skipped: 0, Time elapsed: 0.001 sec
23-Apr-2020 18:18:06 Running org.cip4.printtalk.builder.PrintTalkBuilderTest
23-Apr-2020 18:18:06 Tests run: 7, Failures: 0, Errors: 0, Skipped: 0, Time elapsed: 0.005 sec
23-Apr-2020 18:18:06 Running org.cip4.printtalk.examples.PrintTalkSchemaTest
23-Apr-2020 18:18:06 Tests run: 1, Failures: 0, Errors: 0, Skipped: 0, Time elapsed: 0.041 sec
23-Apr-2020 18:18:06
23-Apr-2020 18:18:06 Results :
23-Apr-2020 18:18:06
23-Apr-2020 18:18:06 Failed tests:   testReorderID(org.cip4.printtalk.PurchaseOrderTest): expected:<[Valid]> but was:<[Error]>
23-Apr-2020 18:18:06   testSetDescriptiveName(org.cip4.printtalk.PurchaseOrderTest): expected:<[Valid]> but was:<[Error]>
23-Apr-2020 18:18:06   testQuoteID(org.cip4.printtalk.PurchaseOrderTest): expected:<[Valid]> but was:<[Error]>
23-Apr-2020 18:18:06   testComment(org.cip4.printtalk.PurchaseOrderTest): expected:<[Valid]> but was:<[Error]>
23-Apr-2020 18:18:06   testappendXJDF(org.cip4.printtalk.RFQTest): expected:<[Valid]> but was:<[Error]>
23-Apr-2020 18:18:06   testCurrency(org.cip4.printtalk.RFQTest): expected:<[Valid]> but was:<[Error]>
23-Apr-2020 18:18:06   testsetExpiresDays(org.cip4.printtalk.RFQTest): expected:<[Valid]> but was:<[Error]>
23-Apr-2020 18:18:06   testAmountPrices(org.cip4.printtalk.RFQTest): expected:<[Valid]> but was:<[Error]>
23-Apr-2020 18:18:06   testMasterContract(org.cip4.printtalk.RFQTest): expected:<[Valid]> but was:<[Error]>
23-Apr-2020 18:18:06   testMatchesAvailability(org.cip4.printtalk.StockLevelResponseTest): expected:<[Valid]> but was:<[Error]>
23-Apr-2020 18:18:06   testMasterContract(org.cip4.printtalk.StockLevelResponseTest): expected:<[Valid]> but was:<[Error]>
23-Apr-2020 18:18:06   testComplete(org.cip4.printtalk.StockLevelTest): expected:<[Valid]> but was:<[Error]>
23-Apr-2020 18:18:06
23-Apr-2020 18:18:06 Tests run: 154, Failures: 12, Errors: 0, Skipped: 2
23-Apr-2020 18:18:06
23-Apr-2020 18:18:06 [INFO] ------------------------------------------------------------------------
23-Apr-2020 18:18:06 [INFO] BUILD FAILURE
23-Apr-2020 18:18:06 [INFO] ------------------------------------------------------------------------
23-Apr-2020 18:18:06 [INFO] Total time: 15.927 s
23-Apr-2020 18:18:06 [INFO] Finished at: 2020-04-23T18:18:06+02:00
23-Apr-2020 18:18:06 [INFO] Final Memory: 26M/216M
23-Apr-2020 18:18:06 [INFO] ------------------------------------------------------------------------
23-Apr-2020 18:18:06 [ERROR] Failed to execute goal org.apache.maven.plugins:maven-surefire-plugin:2.12.4:test (default-test) on project PrintTalkJ: There are test failures.
23-Apr-2020 18:18:06 [ERROR]
23-Apr-2020 18:18:06 [ERROR] Please refer to /Users/cip4secretariat/Bamboo/bamboo-agent-1/xml-data/build-dir/LIB-PTKJ-MACOSX/target/surefire-reports for the individual test results.
23-Apr-2020 18:18:06 [ERROR] -> [Help 1]
23-Apr-2020 18:18:06 [ERROR]
23-Apr-2020 18:18:06 [ERROR] To see the full stack trace of the errors, re-run Maven with the -e switch.
23-Apr-2020 18:18:06 [ERROR] Re-run Maven using the -X switch to enable full debug logging.
23-Apr-2020 18:18:06 [ERROR]
23-Apr-2020 18:18:06 [ERROR] For more information about the errors and possible solutions, please read the following articles:
23-Apr-2020 18:18:06 [ERROR] [Help 1] http://cwiki.apache.org/confluence/display/MAVEN/MojoFailureException
23-Apr-2020 18:18:06 Failing task since return code of [/Applications/apache-maven/bin/mvn --batch-mode -Djava.io.tmpdir=/var/folders/wk/5q2_r82n2bdg6xz81xb04hjh0000gn/T/LIB-PTKJ-MACOSX clean test] was 1 while expected 0
23-Apr-2020 18:18:06 Parsing test results under /Users/cip4secretariat/Bamboo/bamboo-agent-1/xml-data/build-dir/LIB-PTKJ-MACOSX...
23-Apr-2020 18:18:06 Finished task 'Test' with result: Failed
23-Apr-2020 18:18:06 Running post build plugin 'Docker Container Cleanup'
23-Apr-2020 18:18:06 Running post build plugin 'NCover Results Collector'
23-Apr-2020 18:18:06 Running post build plugin 'Clover Results Collector'
23-Apr-2020 18:18:06 Running post build plugin 'npm Cache Cleanup'
23-Apr-2020 18:18:06 Running post build plugin 'Artifact Copier'
23-Apr-2020 18:18:06 Finalising the build...
23-Apr-2020 18:18:06 Stopping timer.
23-Apr-2020 18:18:06 Build LIB-PTKJ-MACOSX-811 completed.
23-Apr-2020 18:17:03 Running on server: post build plugin 'NCover Results Collector'
23-Apr-2020 18:17:03 Running on server: post build plugin 'Build Hanging Detection Configuration'
23-Apr-2020 18:17:03 Running on server: post build plugin 'Clover Delta Calculator'
23-Apr-2020 18:17:03 Running on server: post build plugin 'Maven Dependencies Postprocessor'
23-Apr-2020 18:17:03 All post build plugins have finished
23-Apr-2020 18:17:03 Generating build results summary...
23-Apr-2020 18:17:03 Saving build results to disk...
23-Apr-2020 18:17:03 Logging substituted variables...
23-Apr-2020 18:17:03 Indexing build results...
23-Apr-2020 18:17:03 Finished building LIB-PTKJ-MACOSX-811.