Build: #44 failed Release build for PrintTalkJ 2.1.6.2 by Stefan Meissner

Logs

The following logs have been generated by the jobs in this plan.
  • Expand all
  • Collapse all
Job Logs
Collapse build RELEASE Default Stage Download or View
01-Jan-1970 01:00:00 [INFO]
01-Jan-1970 01:00:00 [INFO] ------------------------------------------------------------------------
01-Jan-1970 01:00:00 [INFO] Building PrintTalkJ 2.1.6.3-SNAPSHOT
01-Jan-1970 01:00:00 [INFO] ------------------------------------------------------------------------
01-Jan-1970 01:00:00 [INFO]
01-Jan-1970 01:00:00 [INFO] --- versions-maven-plugin:2.5:use-dep-version (default-cli) @ PrintTalkJ ---
01-Jan-1970 01:00:00 [INFO]
01-Jan-1970 01:00:00 [INFO] ------------------------------------------------------------------------
01-Jan-1970 01:00:00 [INFO] Skipping PrintTalkJ
01-Jan-1970 01:00:00 [INFO] This project has been banned from the build due to previous failures.
01-Jan-1970 01:00:00 [INFO] ------------------------------------------------------------------------
01-Jan-1970 01:00:00 [INFO] ------------------------------------------------------------------------
01-Jan-1970 01:00:00 [INFO] BUILD FAILURE
01-Jan-1970 01:00:00 [INFO] ------------------------------------------------------------------------
01-Jan-1970 01:00:00 [INFO] Total time: 4.350 s
01-Jan-1970 01:00:00 [INFO] Finished at: 2018-03-06T15:36:11Z
01-Jan-1970 01:00:00 [INFO] Final Memory: 21M/225M
01-Jan-1970 01:00:00 [INFO] ------------------------------------------------------------------------
01-Jan-1970 01:00:00 [ERROR] Failed to execute goal org.codehaus.mojo:versions-maven-plugin:2.5:use-dep-version (default-cli) on project PrintTalkJ: Version LATEST is not available for artifact org.cip4.lib.jdf:JDFLibJ -> [Help 1]
01-Jan-1970 01:00:00 [ERROR]
01-Jan-1970 01:00:00 [ERROR] To see the full stack trace of the errors, re-run Maven with the -e switch.
01-Jan-1970 01:00:00 [ERROR] Re-run Maven using the -X switch to enable full debug logging.
01-Jan-1970 01:00:00 [ERROR]
01-Jan-1970 01:00:00 [ERROR] For more information about the errors and possible solutions, please read the following articles:
01-Jan-1970 01:00:00 [ERROR] [Help 1] http://cwiki.apache.org/confluence/display/MAVEN/MojoExecutionException