Build: #52 failed Release build for PrintTalkJ 2.1.6.2 by Stefan Meissner

Logs

The following logs have been generated by the jobs in this plan.
  • Expand all
  • Collapse all
Job Logs
Collapse build RELEASE Default Stage Download or View
01-Jan-1970 01:00:00 [INFO] Scanning for projects...
01-Jan-1970 01:00:00 [INFO] Inspecting build with total of 1 modules...
01-Jan-1970 01:00:00 [INFO] Installing Nexus Staging features:
01-Jan-1970 01:00:00 [INFO]   ... total of 1 executions of maven-deploy-plugin replaced with nexus-staging-maven-plugin
01-Jan-1970 01:00:00 [INFO]
01-Jan-1970 01:00:00 [INFO] ------------------------------------------------------------------------
01-Jan-1970 01:00:00 [INFO] Building PrintTalkJ 2.1.6.2
01-Jan-1970 01:00:00 [INFO] ------------------------------------------------------------------------
01-Jan-1970 01:00:00 [INFO]
01-Jan-1970 01:00:00 [INFO] --- maven-release-plugin:2.5.3:prepare (default-cli) @ PrintTalkJ ---
01-Jan-1970 01:00:00 [INFO] ------------------------------------------------------------------------
01-Jan-1970 01:00:00 [INFO] BUILD FAILURE
01-Jan-1970 01:00:00 [INFO] ------------------------------------------------------------------------
01-Jan-1970 01:00:00 [INFO] Total time: 1.492 s
01-Jan-1970 01:00:00 [INFO] Finished at: 2018-03-06T16:07:28Z
01-Jan-1970 01:00:00 [INFO] Final Memory: 17M/220M
01-Jan-1970 01:00:00 [INFO] ------------------------------------------------------------------------
01-Jan-1970 01:00:00 [ERROR] Failed to execute goal org.apache.maven.plugins:maven-release-plugin:2.5.3:prepare (default-cli) on project PrintTalkJ: You don't have a SNAPSHOT project in the reactor projects list. -> [Help 1]
01-Jan-1970 01:00:00 [ERROR]
01-Jan-1970 01:00:00 [ERROR] To see the full stack trace of the errors, re-run Maven with the -e switch.
01-Jan-1970 01:00:00 [ERROR] Re-run Maven using the -X switch to enable full debug logging.
01-Jan-1970 01:00:00 [ERROR]
01-Jan-1970 01:00:00 [ERROR] For more information about the errors and possible solutions, please read the following articles:
01-Jan-1970 01:00:00 [ERROR] [Help 1] http://cwiki.apache.org/confluence/display/MAVEN/MojoFailureException
01-Jan-1970 01:00:00 Unable to publish artifact [jar-files]: the source directory /home/cip4secretariat/bamboo/agent-1/xml-data/build-dir/LIB-PTKJRELEASE-JOB1/target does not exist.