Build: #53 failed Release build for PrintTalkJ 2.1.6.2 by Stefan Meissner

Logs

The following logs have been generated by the jobs in this plan.
  • Expand all
  • Collapse all
Job Logs
Collapse build RELEASE Default Stage Download or View
01-Jan-1970 01:00:00 [INFO] [INFO] Finished at: 2018-03-06T16:13:40Z
01-Jan-1970 01:00:00 [INFO] [INFO] Final Memory: 40M/380M
01-Jan-1970 01:00:00 [INFO] [INFO] ------------------------------------------------------------------------
01-Jan-1970 01:00:00 [INFO] [WARNING] The requested profile "release" could not be activated because it does not exist.
01-Jan-1970 01:00:00 [INFO] [ERROR] Failed to execute goal org.sonatype.plugins:nexus-staging-maven-plugin:1.6.5:deploy (injected-nexus-deploy) on project PrintTalkJ: Could not perform action: there are failing staging rules! Staging rules failure! -> [Help 1]
01-Jan-1970 01:00:00 [INFO] [ERROR]
01-Jan-1970 01:00:00 [INFO] [ERROR] To see the full stack trace of the errors, re-run Maven with the -e switch.
01-Jan-1970 01:00:00 [INFO] [ERROR] Re-run Maven using the -X switch to enable full debug logging.
01-Jan-1970 01:00:00 [INFO] [ERROR]
01-Jan-1970 01:00:00 [INFO] [ERROR] For more information about the errors and possible solutions, please read the following articles:
01-Jan-1970 01:00:00 [INFO] [ERROR] [Help 1] http://cwiki.apache.org/confluence/display/MAVEN/MojoExecutionException
01-Jan-1970 01:00:00 [INFO] ------------------------------------------------------------------------
01-Jan-1970 01:00:00 [INFO] BUILD FAILURE
01-Jan-1970 01:00:00 [INFO] ------------------------------------------------------------------------
01-Jan-1970 01:00:00 [INFO] Total time: 04:05 min
01-Jan-1970 01:00:00 [INFO] Finished at: 2018-03-06T16:13:41Z
01-Jan-1970 01:00:00 [INFO] Final Memory: 15M/226M
01-Jan-1970 01:00:00 [INFO] ------------------------------------------------------------------------
01-Jan-1970 01:00:00 [ERROR] Failed to execute goal org.apache.maven.plugins:maven-release-plugin:2.5.3:perform (default-cli) on project PrintTalkJ: Maven execution failed, exit code: '1' -> [Help 1]
01-Jan-1970 01:00:00 [ERROR]
01-Jan-1970 01:00:00 [ERROR] To see the full stack trace of the errors, re-run Maven with the -e switch.
01-Jan-1970 01:00:00 [ERROR] Re-run Maven using the -X switch to enable full debug logging.
01-Jan-1970 01:00:00 [ERROR]
01-Jan-1970 01:00:00 [ERROR] For more information about the errors and possible solutions, please read the following articles:
01-Jan-1970 01:00:00 [ERROR] [Help 1] http://cwiki.apache.org/confluence/display/MAVEN/MojoExecutionException