Stages & jobs

  1. Default Stage

Logs

The following logs have been generated by the jobs in this plan.
  • Expand all
  • Collapse all
Job Logs
Collapse build LINUX Default Stage Download or View
21-Sep-2018 14:47:31   symbol:   method assertEquals(List<String>,List<String>)
21-Sep-2018 14:47:31   location: class ValidationDispatcherTest
21-Sep-2018 14:47:31 Note: Some input files use or override a deprecated API.
21-Sep-2018 14:47:31 Note: Recompile with -Xlint:deprecation for details.
21-Sep-2018 14:47:31 Note: Some input files use unchecked or unsafe operations.
21-Sep-2018 14:47:31 Note: Recompile with -Xlint:unchecked for details.
21-Sep-2018 14:47:31 2 errors
21-Sep-2018 14:47:31 1 warning
21-Sep-2018 14:47:31
21-Sep-2018 14:47:31 FAILURE: Build failed with an exception.
21-Sep-2018 14:47:31
21-Sep-2018 14:47:31 * What went wrong:
21-Sep-2018 14:47:31 Execution failed for task ':compileTestJava'.
21-Sep-2018 14:47:31 > Compilation failed; see the compiler error output for details.
21-Sep-2018 14:47:31 4 actionable tasks: 4 executed
21-Sep-2018 14:47:31
21-Sep-2018 14:47:31 * Try:
21-Sep-2018 14:47:31 Run with --stacktrace option to get the stack trace. Run with --info or --debug option to get more log output. Run with --scan to get full insights.
21-Sep-2018 14:47:31
21-Sep-2018 14:47:31 * Get more help at https://help.gradle.org
21-Sep-2018 14:47:31
21-Sep-2018 14:47:31 BUILD FAILED in 30s
21-Sep-2018 14:47:32 Unable to publish artifact [jar]: the source directory /home/cip4secretariat/bamboo/agent-2/xml-data/build-dir/LIB-XJDFLIB-LINUX/build/libs does not exist.
21-Sep-2018 14:47:32 Unable to publish artifact [src]: the source directory /home/cip4secretariat/bamboo/agent-2/xml-data/build-dir/LIB-XJDFLIB-LINUX/build/libs does not exist.
21-Sep-2018 14:47:32 Unable to publish artifact [doc]: the source directory /home/cip4secretariat/bamboo/agent-2/xml-data/build-dir/LIB-XJDFLIB-LINUX/build/libs does not exist.
Collapse build MACOSX Default Stage Download or View
21-Sep-2018 14:47:25 /Users/cip4secretariat/Bamboo/bamboo-agent-1/xml-data/build-dir/LIB-XJDFLIB-MACOSX/src/test/java/org/cip4/lib/xjdf/validator/ValidationDispatcherTest.java:104: error: cannot find symbol
21-Sep-2018 14:47:25         assertEquals(Collections.singletonList("some violation"), result.getViolations());
21-Sep-2018 14:47:25         ^
21-Sep-2018 14:47:25   symbol:   method assertEquals(List<String>,List<String>)
21-Sep-2018 14:47:25   location: class ValidationDispatcherTest
21-Sep-2018 14:47:25 Note: Some input files use or override a deprecated API.
21-Sep-2018 14:47:25 Note: Recompile with -Xlint:deprecation for details.
21-Sep-2018 14:47:25 Note: Some input files use unchecked or unsafe operations.
21-Sep-2018 14:47:25 Note: Recompile with -Xlint:unchecked for details.
21-Sep-2018 14:47:25 2 errors
21-Sep-2018 14:47:25 1 warning
21-Sep-2018 14:47:25
21-Sep-2018 14:47:25 FAILURE: Build failed with an exception.
21-Sep-2018 14:47:25
21-Sep-2018 14:47:25 * What went wrong:
21-Sep-2018 14:47:25 Execution failed for task ':compileTestJava'.
21-Sep-2018 14:47:25 > Compilation failed; see the compiler error output for details.
21-Sep-2018 14:47:25
21-Sep-2018 14:47:25 * Try:
21-Sep-2018 14:47:25 Run with --stacktrace option to get the stack trace. Run with --info or --debug option to get more log output. Run with --scan to get full insights.
21-Sep-2018 14:47:25
21-Sep-2018 14:47:25 * Get more help at https://help.gradle.org
21-Sep-2018 14:47:25
21-Sep-2018 14:47:25 BUILD FAILED in 25s
21-Sep-2018 14:47:25 4 actionable tasks: 4 executed
Collapse build WINDOWS Default Stage Download or View
21-Sep-2018 14:48:32         ^
21-Sep-2018 14:48:32   symbol:   method assertEquals(List<String>,List<String>)
21-Sep-2018 14:48:32   location: class ValidationDispatcherTest
21-Sep-2018 14:48:32 Note: Some input files use or override a deprecated API.
21-Sep-2018 14:48:32 Note: Recompile with -Xlint:deprecation for details.
21-Sep-2018 14:48:32 Note: Some input files use unchecked or unsafe operations.
21-Sep-2018 14:48:32 Note: Recompile with -Xlint:unchecked for details.
21-Sep-2018 14:48:32 2 errors
21-Sep-2018 14:48:32 1 warning
21-Sep-2018 14:48:32
21-Sep-2018 14:48:32 > Task :compileTestJava FAILED
21-Sep-2018 14:48:32
21-Sep-2018 14:48:32 FAILURE: Build failed with an exception.
21-Sep-2018 14:48:32
21-Sep-2018 14:48:32 * What went wrong:
21-Sep-2018 14:48:32 Execution failed for task ':compileTestJava'.
21-Sep-2018 14:48:32 > Compilation failed; see the compiler error output for details.
21-Sep-2018 14:48:32
21-Sep-2018 14:48:32 * Try:
21-Sep-2018 14:48:32 Run with --stacktrace option to get the stack trace. Run with --info or --debug option to get more log output. Run with --scan to get full insights.
21-Sep-2018 14:48:32
21-Sep-2018 14:48:32 * Get more help at https://help.gradle.org
21-Sep-2018 14:48:32
21-Sep-2018 14:48:32 BUILD FAILED in 1m 34s
21-Sep-2018 14:48:32 4 actionable tasks: 4 executed