Build: #517 failed

Job: build LINUX failed

Stages & jobs

  1. Default Stage

Job result summary

Completed
Duration
32 seconds
Agent
Linux Agent #2
Revision
e740ea4e63e593c82a693e84039f520ba7fc6f36 e740ea4e63e593c82a693e84039f520ba7fc6f36
Fixed in
#518 (Code changes detected)
No failed test found. A possible compilation error occurred.

Error summary

The build generated some errors. See the full build log for more details.

warning: [options] bootstrap class path not set in conjunction with -source 1.7
/home/cip4secretariat/bamboo/agent-2/xml-data/build-dir/LIB-XJDFLIB-LINUX/src/main/java/org/cip4/lib/xjdf/xml/internal/AbstractXmlValidator.java:3: warning: DOMInputImpl is internal proprietary API and may be removed in a future release
import com.sun.org.apache.xerces.internal.dom.DOMInputImpl;
                                             ^
/home/cip4secretariat/bamboo/agent-2/xml-data/build-dir/LIB-XJDFLIB-LINUX/src/main/java/org/cip4/lib/xjdf/xml/internal/AbstractXmlValidator.java:91: warning: DOMInputImpl is internal proprietary API and may be removed in a future release
            LSInput lsInput = new DOMInputImpl(publicId, systemId, null);
                                  ^
Note: Some input files use or override a deprecated API.
Note: Recompile with -Xlint:deprecation for details.
Note: Some input files use unchecked or unsafe operations.
Note: Recompile with -Xlint:unchecked for details.
3 warnings
warning: [options] bootstrap class path not set in conjunction with -source 1.7
/home/cip4secretariat/bamboo/agent-2/xml-data/build-dir/LIB-XJDFLIB-LINUX/src/test/java/org/cip4/lib/xjdf/validator/ValidationDispatcherTest.java:103: error: cannot find symbol
        assertFalse(result.isValid());
        ^
  symbol:   method assertFalse(boolean)
  location: class ValidationDispatcherTest
/home/cip4secretariat/bamboo/agent-2/xml-data/build-dir/LIB-XJDFLIB-LINUX/src/test/java/org/cip4/lib/xjdf/validator/ValidationDispatcherTest.java:104: error: cannot find symbol
        assertEquals(Collections.singletonList("some violation"), result.getViolations());
        ^
  symbol:   method assertEquals(List<String>,List<String>)
  location: class ValidationDispatcherTest
Note: Some input files use or override a deprecated API.
Note: Recompile with -Xlint:deprecation for details.
Note: Some input files use unchecked or unsafe operations.
Note: Recompile with -Xlint:unchecked for details.
2 errors
1 warning

FAILURE: Build failed with an exception.

* What went wrong:
Execution failed for task ':compileTestJava'.
> Compilation failed; see the compiler error output for details.

* Try:
Run with --stacktrace option to get the stack trace. Run with --info or --debug option to get more log output. Run with --scan to get full insights.

* Get more help at https://help.gradle.org

BUILD FAILED in 30s