go ahead here: http://www.marcobrandizi.info/mysite/node/146

Build: #57 failed Rebuilt by Michel Hartmann

Logs

The following logs have been generated by the jobs in this plan.
  • Expand all
  • Collapse all
Job Logs
Collapse gradle RELEASE Default Stage Download or View
10-Sep-2016 18:52:51 FAILURE: Build failed with an exception.
10-Sep-2016 18:52:51
10-Sep-2016 18:52:51 * What went wrong:
10-Sep-2016 18:52:51 Task 'createRelease' not found in root project 'xJdfLib'.
10-Sep-2016 18:52:51
10-Sep-2016 18:52:51 * Try:
10-Sep-2016 18:52:51 Run gradlew tasks to get a list of available tasks. Run with --stacktrace option to get the stack trace. Run with --info or --debug option to get more log output.
10-Sep-2016 18:52:51
10-Sep-2016 18:52:51 BUILD FAILED
10-Sep-2016 18:52:51
10-Sep-2016 18:52:51 Total time: 0.738 secs
10-Sep-2016 18:52:52
10-Sep-2016 18:52:52 FAILURE: Build failed with an exception.
10-Sep-2016 18:52:52
10-Sep-2016 18:52:52 * What went wrong:
10-Sep-2016 18:52:52 Task 'updateVersion' not found in root project 'xJdfLib'.
10-Sep-2016 18:52:52
10-Sep-2016 18:52:52 * Try:
10-Sep-2016 18:52:52 Run gradlew tasks to get a list of available tasks. Run with --stacktrace option to get the stack trace. Run with --info or --debug option to get more log output.
10-Sep-2016 18:52:52
10-Sep-2016 18:52:52 BUILD FAILED
10-Sep-2016 18:52:52
10-Sep-2016 18:52:52 Total time: 0.706 secs
10-Sep-2016 18:52:53 error: pathspec 'tags/xJdfLib-0.11' did not match any file(s) known to git.
10-Sep-2016 18:52:53 Unable to publish artifact [jar-files]: the source directory /Users/cip4secretariat/bamboo-agents/two/xml-data/build-dir/LIB-XJDFLIBRELEASE-GREL/build/libs does not exist.