Build: #341 failed Changes by R2 D2

Stages & jobs

  1. Default Stage

Logs

The following logs have been generated by the jobs in this plan.
  • Expand all
  • Collapse all
Job Logs
Collapse build LINUX Default Stage Download or View
01-Jan-1970 01:00:00 [ERROR]
01-Jan-1970 01:00:00 [ERROR]
01-Jan-1970 01:00:00 [ERROR] Cleaning up local stage directory after a Rule failure during close of staging repositories: [orgcip4-1069]
01-Jan-1970 01:00:00 [ERROR]  * Deleting context 105e2b532689c6.properties
01-Jan-1970 01:00:00 [ERROR] Cleaning up remote stage repositories after a Rule failure during close of staging repositories: [orgcip4-1069]
01-Jan-1970 01:00:00 [ERROR]  * Dropping failed staging repository with ID "orgcip4-1069" (Rule failure during close of staging repositories: [orgcip4-1069]).
01-Jan-1970 01:00:00
01-Jan-1970 01:00:00 Waiting for operation to complete...
01-Jan-1970 01:00:00 ...
01-Jan-1970 01:00:00
01-Jan-1970 01:00:00 [ERROR] Remote staging finished with a failure: Staging rules failure!
01-Jan-1970 01:00:00 [INFO] ------------------------------------------------------------------------
01-Jan-1970 01:00:00 [INFO] BUILD FAILURE
01-Jan-1970 01:00:00 [INFO] ------------------------------------------------------------------------
01-Jan-1970 01:00:00 [INFO] Total time: 01:27 min
01-Jan-1970 01:00:00 [INFO] Finished at: 2017-10-27T07:50:07Z
01-Jan-1970 01:00:00 [INFO] Final Memory: 48M/243M
01-Jan-1970 01:00:00 [INFO] ------------------------------------------------------------------------
01-Jan-1970 01:00:00 [ERROR] Failed to execute goal org.sonatype.plugins:nexus-staging-maven-plugin:1.6.5:deploy (injected-nexus-deploy) on project xPrintTalkLib: Remote staging failed: Staging rules failure! -> [Help 1]
01-Jan-1970 01:00:00 [ERROR]
01-Jan-1970 01:00:00 [ERROR] To see the full stack trace of the errors, re-run Maven with the -e switch.
01-Jan-1970 01:00:00 [ERROR] Re-run Maven using the -X switch to enable full debug logging.
01-Jan-1970 01:00:00 [ERROR]
01-Jan-1970 01:00:00 [ERROR] For more information about the errors and possible solutions, please read the following articles:
01-Jan-1970 01:00:00 [ERROR] [Help 1] http://cwiki.apache.org/confluence/display/MAVEN/MojoExecutionException