Build: #345 failed Manual run by Michel Hartmann

Stages & jobs

  1. Default Stage

Logs

The following logs have been generated by the jobs in this plan.
  • Expand all
  • Collapse all
Job Logs
Collapse build LINUX Default Stage Download or View
17-Sep-2018 23:56:58 Build file '/home/cip4secretariat/bamboo/agent-1/xml-data/build-dir/LIB-XPTKLIB-LINUX/build.gradle' line: 67
17-Sep-2018 23:56:58
17-Sep-2018 23:56:58 * What went wrong:
17-Sep-2018 23:56:58 Could not determine the dependencies of task ':exractXjdfSchema'.
17-Sep-2018 23:56:58 > Could not resolve all files for configuration ':xjdf'.
17-Sep-2018 23:56:58    > Could not find org.cip4.lib.xjdf:xJdfLib:0.14-SNAPSHOT.
17-Sep-2018 23:56:58      Searched in the following locations:
17-Sep-2018 23:56:58        - file:/home/cip4secretariat/.m2/repository/org/cip4/lib/xjdf/xJdfLib/0.14-SNAPSHOT/maven-metadata.xml
17-Sep-2018 23:56:58        - file:/home/cip4secretariat/.m2/repository/org/cip4/lib/xjdf/xJdfLib/0.14-SNAPSHOT/xJdfLib-0.14-SNAPSHOT.pom
17-Sep-2018 23:56:58        - file:/home/cip4secretariat/.m2/repository/org/cip4/lib/xjdf/xJdfLib/0.14-SNAPSHOT/xJdfLib-0.14-SNAPSHOT.jar
17-Sep-2018 23:56:58        - https://repo.maven.apache.org/maven2/org/cip4/lib/xjdf/xJdfLib/0.14-SNAPSHOT/maven-metadata.xml
17-Sep-2018 23:56:58        - https://repo.maven.apache.org/maven2/org/cip4/lib/xjdf/xJdfLib/0.14-SNAPSHOT/xJdfLib-0.14-SNAPSHOT.pom
17-Sep-2018 23:56:58        - https://repo.maven.apache.org/maven2/org/cip4/lib/xjdf/xJdfLib/0.14-SNAPSHOT/xJdfLib-0.14-SNAPSHOT.jar
17-Sep-2018 23:56:58      Required by:
17-Sep-2018 23:56:58          project :
17-Sep-2018 23:56:58
17-Sep-2018 23:56:58 * Try:
17-Sep-2018 23:56:58 Run with --stacktrace option to get the stack trace. Run with --info or --debug option to get more log output. Run with --scan to get full insights.
17-Sep-2018 23:56:58
17-Sep-2018 23:56:58 * Get more help at https://help.gradle.org
17-Sep-2018 23:56:58
17-Sep-2018 23:56:58 BUILD FAILED in 9s
17-Sep-2018 23:56:59 Unable to publish artifact [doc]: the source directory /home/cip4secretariat/bamboo/agent-1/xml-data/build-dir/LIB-XPTKLIB-LINUX/target does not exist.
17-Sep-2018 23:56:59 Unable to publish artifact [jar]: the source directory /home/cip4secretariat/bamboo/agent-1/xml-data/build-dir/LIB-XPTKLIB-LINUX/target does not exist.
17-Sep-2018 23:56:59 Unable to publish artifact [src]: the source directory /home/cip4secretariat/bamboo/agent-1/xml-data/build-dir/LIB-XPTKLIB-LINUX/target does not exist.
Collapse build MACOSX Default Stage Download or View
17-Sep-2018 23:57:03 FAILURE: Build failed with an exception.
17-Sep-2018 23:57:03
17-Sep-2018 23:57:03 * Where:
17-Sep-2018 23:57:03 Build file '/Users/cip4secretariat/Bamboo/bamboo-agent-1/xml-data/build-dir/LIB-XPTKLIB-MACOSX/build.gradle' line: 67
17-Sep-2018 23:57:03
17-Sep-2018 23:57:03 * What went wrong:
17-Sep-2018 23:57:03 Could not determine the dependencies of task ':exractXjdfSchema'.
17-Sep-2018 23:57:03 > Could not resolve all files for configuration ':xjdf'.
17-Sep-2018 23:57:03    > Could not find org.cip4.lib.xjdf:xJdfLib:0.14-SNAPSHOT.
17-Sep-2018 23:57:03      Searched in the following locations:
17-Sep-2018 23:57:03        - file:/Users/cip4secretariat/.m2/repository/org/cip4/lib/xjdf/xJdfLib/0.14-SNAPSHOT/maven-metadata.xml
17-Sep-2018 23:57:03        - file:/Users/cip4secretariat/.m2/repository/org/cip4/lib/xjdf/xJdfLib/0.14-SNAPSHOT/xJdfLib-0.14-SNAPSHOT.pom
17-Sep-2018 23:57:03        - file:/Users/cip4secretariat/.m2/repository/org/cip4/lib/xjdf/xJdfLib/0.14-SNAPSHOT/xJdfLib-0.14-SNAPSHOT.jar
17-Sep-2018 23:57:03        - https://repo.maven.apache.org/maven2/org/cip4/lib/xjdf/xJdfLib/0.14-SNAPSHOT/maven-metadata.xml
17-Sep-2018 23:57:03        - https://repo.maven.apache.org/maven2/org/cip4/lib/xjdf/xJdfLib/0.14-SNAPSHOT/xJdfLib-0.14-SNAPSHOT.pom
17-Sep-2018 23:57:03        - https://repo.maven.apache.org/maven2/org/cip4/lib/xjdf/xJdfLib/0.14-SNAPSHOT/xJdfLib-0.14-SNAPSHOT.jar
17-Sep-2018 23:57:03      Required by:
17-Sep-2018 23:57:03          project :
17-Sep-2018 23:57:03
17-Sep-2018 23:57:03 * Try:
17-Sep-2018 23:57:03 Run with --stacktrace option to get the stack trace. Run with --info or --debug option to get more log output. Run with --scan to get full insights.
17-Sep-2018 23:57:03
17-Sep-2018 23:57:03 * Get more help at https://help.gradle.org
17-Sep-2018 23:57:03
17-Sep-2018 23:57:03 BUILD FAILED in 14s
Collapse build WINDOWS Default Stage Download or View
17-Sep-2018 23:57:08 FAILURE: Build failed with an exception.
17-Sep-2018 23:57:08
17-Sep-2018 23:57:08 * Where:
17-Sep-2018 23:57:08 Build file 'D:\bamboo\agent-2\xml-data\build-dir\LIB-XPTKLIB-WINDOWS\build.gradle' line: 67
17-Sep-2018 23:57:08
17-Sep-2018 23:57:08 * What went wrong:
17-Sep-2018 23:57:08 Could not determine the dependencies of task ':exractXjdfSchema'.
17-Sep-2018 23:57:08 > Could not resolve all files for configuration ':xjdf'.
17-Sep-2018 23:57:08    > Could not find org.cip4.lib.xjdf:xJdfLib:0.14-SNAPSHOT.
17-Sep-2018 23:57:08      Searched in the following locations:
17-Sep-2018 23:57:08        - file:/C:/Users/cip4/.m2/repository/org/cip4/lib/xjdf/xJdfLib/0.14-SNAPSHOT/maven-metadata.xml
17-Sep-2018 23:57:08        - file:/C:/Users/cip4/.m2/repository/org/cip4/lib/xjdf/xJdfLib/0.14-SNAPSHOT/xJdfLib-0.14-SNAPSHOT.pom
17-Sep-2018 23:57:08        - file:/C:/Users/cip4/.m2/repository/org/cip4/lib/xjdf/xJdfLib/0.14-SNAPSHOT/xJdfLib-0.14-SNAPSHOT.jar
17-Sep-2018 23:57:08        - https://repo.maven.apache.org/maven2/org/cip4/lib/xjdf/xJdfLib/0.14-SNAPSHOT/maven-metadata.xml
17-Sep-2018 23:57:08        - https://repo.maven.apache.org/maven2/org/cip4/lib/xjdf/xJdfLib/0.14-SNAPSHOT/xJdfLib-0.14-SNAPSHOT.pom
17-Sep-2018 23:57:08        - https://repo.maven.apache.org/maven2/org/cip4/lib/xjdf/xJdfLib/0.14-SNAPSHOT/xJdfLib-0.14-SNAPSHOT.jar
17-Sep-2018 23:57:08      Required by:
17-Sep-2018 23:57:08          project :
17-Sep-2018 23:57:08
17-Sep-2018 23:57:08 * Try:
17-Sep-2018 23:57:08 Run with --stacktrace option to get the stack trace. Run with --info or --debug option to get more log output. Run with --scan to get full insights.
17-Sep-2018 23:57:08
17-Sep-2018 23:57:08 * Get more help at https://help.gradle.org
17-Sep-2018 23:57:08
17-Sep-2018 23:57:08 BUILD FAILED in 21s