Build: #346 failed

Job: build LINUX failed

Stages & jobs

  1. Default Stage

Job result summary

Completed
Duration
26 seconds
Agent
Linux Agent #1
Revision
7ef9f8225dc8d98b5a6882917a6daa8089978239 7ef9f8225dc8d98b5a6882917a6daa8089978239
Total tests
19
Failing since
#344 (Code changes detected – )
Fixed in
#347 (Code changes detected)
No failed test found. A possible compilation error occurred.

Tests

  • 19 tests in total
  • 12 seconds taken in total.

Error summary

The build generated some errors. See the full build log for more details.

/home/cip4secretariat/bamboo/agent-1/xml-data/build-dir/LIB-XPTKLIB-LINUX/src/generated/java/org/cip4/lib/xprinttalk/schema/ObjectFactory.java:327: warning: no @return
    public JAXBElement<RFQ> createRFQ(RFQ value) {
                            ^
/home/cip4secretariat/bamboo/agent-1/xml-data/build-dir/LIB-XPTKLIB-LINUX/src/generated/java/org/cip4/lib/xprinttalk/schema/ObjectFactory.java:336: warning: no @param for value
    public JAXBElement<Quotation> createQuote(Quotation value) {
                                  ^
/home/cip4secretariat/bamboo/agent-1/xml-data/build-dir/LIB-XPTKLIB-LINUX/src/generated/java/org/cip4/lib/xprinttalk/schema/ObjectFactory.java:336: warning: no @return
    public JAXBElement<Quotation> createQuote(Quotation value) {
                                  ^
/home/cip4secretariat/bamboo/agent-1/xml-data/build-dir/LIB-XPTKLIB-LINUX/src/generated/java/org/cip4/lib/xprinttalk/schema/ObjectFactory.java:345: warning: no @param for value
    public JAXBElement<Quotation> createQuotation(Quotation value) {
                                  ^
/home/cip4secretariat/bamboo/agent-1/xml-data/build-dir/LIB-XPTKLIB-LINUX/src/generated/java/org/cip4/lib/xprinttalk/schema/ObjectFactory.java:345: warning: no @return
    public JAXBElement<Quotation> createQuotation(Quotation value) {
                                  ^
/home/cip4secretariat/bamboo/agent-1/xml-data/build-dir/LIB-XPTKLIB-LINUX/src/generated/java/org/cip4/lib/xprinttalk/schema/ObjectFactory.java:354: warning: no @param for value
    public JAXBElement<PurchaseOrder> createPurchaseOrder(PurchaseOrder value) {
                                      ^
/home/cip4secretariat/bamboo/agent-1/xml-data/build-dir/LIB-XPTKLIB-LINUX/src/generated/java/org/cip4/lib/xprinttalk/schema/ObjectFactory.java:354: warning: no @return
    public JAXBElement<PurchaseOrder> createPurchaseOrder(PurchaseOrder value) {
                                      ^
/home/cip4secretariat/bamboo/agent-1/xml-data/build-dir/LIB-XPTKLIB-LINUX/src/generated/java/org/cip4/lib/xprinttalk/schema/ObjectFactory.java:363: warning: no @param for value
    public JAXBElement<Confirmation> createConfirmation(Confirmation value) {
                                     ^
/home/cip4secretariat/bamboo/agent-1/xml-data/build-dir/LIB-XPTKLIB-LINUX/src/generated/java/org/cip4/lib/xprinttalk/schema/ObjectFactory.java:363: warning: no @return
    public JAXBElement<Confirmation> createConfirmation(Confirmation value) {
                                     ^
/home/cip4secretariat/bamboo/agent-1/xml-data/build-dir/LIB-XPTKLIB-LINUX/src/generated/java/org/cip4/lib/xprinttalk/schema/ObjectFactory.java:372: warning: no @param for value
    public JAXBElement<Cancellation> createCancellation(Cancellation value) {
                                     ^
/home/cip4secretariat/bamboo/agent-1/xml-data/build-dir/LIB-XPTKLIB-LINUX/src/generated/java/org/cip4/lib/xprinttalk/schema/ObjectFactory.java:372: warning: no @return
    public JAXBElement<Cancellation> createCancellation(Cancellation value) {
                                     ^
/home/cip4secretariat/bamboo/agent-1/xml-data/build-dir/LIB-XPTKLIB-LINUX/src/generated/java/org/cip4/lib/xprinttalk/schema/ObjectFactory.java:381: warning: no @param for value
    public JAXBElement<Refusal> createRefusal(Refusal value) {
                                ^
/home/cip4secretariat/bamboo/agent-1/xml-data/build-dir/LIB-XPTKLIB-LINUX/src/generated/java/org/cip4/lib/xprinttalk/schema/ObjectFactory.java:381: warning: no @return
    public JAXBElement<Refusal> createRefusal(Refusal value) {
                                ^
/home/cip4secretariat/bamboo/agent-1/xml-data/build-dir/LIB-XPTKLIB-LINUX/src/generated/java/org/cip4/lib/xprinttalk/schema/ObjectFactory.java:390: warning: no @param for value
    public JAXBElement<OrderStatusRequest> createOrderStatusRequest(OrderStatusRequest value) {
                                           ^
/home/cip4secretariat/bamboo/agent-1/xml-data/build-dir/LIB-XPTKLIB-LINUX/src/generated/java/org/cip4/lib/xprinttalk/schema/ObjectFactory.java:390: warning: no @return
    public JAXBElement<OrderStatusRequest> createOrderStatusRequest(OrderStatusRequest value) {
                                           ^
/home/cip4secretariat/bamboo/agent-1/xml-data/build-dir/LIB-XPTKLIB-LINUX/src/generated/java/org/cip4/lib/xprinttalk/schema/ObjectFactory.java:399: warning: no @param for value
    public JAXBElement<OrderStatusResponse> createOrderStatusResponse(OrderStatusResponse value) {
                                            ^
/home/cip4secretariat/bamboo/agent-1/xml-data/build-dir/LIB-XPTKLIB-LINUX/src/generated/java/org/cip4/lib/xprinttalk/schema/ObjectFactory.java:399: warning: no @return
    public JAXBElement<OrderStatusResponse> createOrderStatusResponse(OrderStatusResponse value) {
                                            ^
/home/cip4secretariat/bamboo/agent-1/xml-data/build-dir/LIB-XPTKLIB-LINUX/src/generated/java/org/cip4/lib/xprinttalk/schema/ObjectFactory.java:408: warning: no @param for value
    public JAXBElement<ProofApprovalRequest> createProofApprovalRequest(ProofApprovalRequest value) {
                                             ^
/home/cip4secretariat/bamboo/agent-1/xml-data/build-dir/LIB-XPTKLIB-LINUX/src/generated/java/org/cip4/lib/xprinttalk/schema/ObjectFactory.java:408: warning: no @return
    public JAXBElement<ProofApprovalRequest> createProofApprovalRequest(ProofApprovalRequest value) {
                                             ^
/home/cip4secretariat/bamboo/agent-1/xml-data/build-dir/LIB-XPTKLIB-LINUX/src/generated/java/org/cip4/lib/xprinttalk/schema/ObjectFactory.java:417: warning: no @param for value
    public JAXBElement<ProofApprovalResponse> createProofApprovalResponse(ProofApprovalResponse value) {
                                              ^
/home/cip4secretariat/bamboo/agent-1/xml-data/build-dir/LIB-XPTKLIB-LINUX/src/generated/java/org/cip4/lib/xprinttalk/schema/ObjectFactory.java:417: warning: no @return
    public JAXBElement<ProofApprovalResponse> createProofApprovalResponse(ProofApprovalResponse value) {
                                              ^
/home/cip4secretariat/bamboo/agent-1/xml-data/build-dir/LIB-XPTKLIB-LINUX/src/generated/java/org/cip4/lib/xprinttalk/schema/ObjectFactory.java:426: warning: no @param for value
    public JAXBElement<Invoice> createInvoice(Invoice value) {
                                ^
/home/cip4secretariat/bamboo/agent-1/xml-data/build-dir/LIB-XPTKLIB-LINUX/src/generated/java/org/cip4/lib/xprinttalk/schema/ObjectFactory.java:426: warning: no @return
    public JAXBElement<Invoice> createInvoice(Invoice value) {
                                ^
/home/cip4secretariat/bamboo/agent-1/xml-data/build-dir/LIB-XPTKLIB-LINUX/src/generated/java/org/cip4/lib/xprinttalk/schema/ObjectFactory.java:435: warning: no @param for value
    public JAXBElement<ReturnJob> createReturnJob(ReturnJob value) {
                                  ^
/home/cip4secretariat/bamboo/agent-1/xml-data/build-dir/LIB-XPTKLIB-LINUX/src/generated/java/org/cip4/lib/xprinttalk/schema/ObjectFactory.java:435: warning: no @return
    public JAXBElement<ReturnJob> createReturnJob(ReturnJob value) {
                                  ^
/home/cip4secretariat/bamboo/agent-1/xml-data/build-dir/LIB-XPTKLIB-LINUX/src/main/java/org/cip4/lib/xprinttalk/PrintTalkNodeFactory.java:23: error: unknown tag: date
* @date 22.06.2012
   ^
/home/cip4secretariat/bamboo/agent-1/xml-data/build-dir/LIB-XPTKLIB-LINUX/src/generated/java/org/cip4/lib/xprinttalk/schema/AbstractPt.java:110: warning: no @return
    public List<Comment> getComment() {
                         ^
/home/cip4secretariat/bamboo/agent-1/xml-data/build-dir/LIB-XPTKLIB-LINUX/src/generated/java/org/cip4/lib/xprinttalk/schema/AbstractPt.java:140: warning: no @return
    public List<GeneralID> getGeneralID() {
                           ^
/home/cip4secretariat/bamboo/agent-1/xml-data/build-dir/LIB-XPTKLIB-LINUX/src/generated/java/org/cip4/lib/xprinttalk/schema/Additional.java:61: warning: no @return
    public double getAmount() {
                  ^

FAILURE: Build failed with an exception.

* What went wrong:
Execution failed for task ':javadoc'.
> Javadoc generation failed. Generated Javadoc options file (useful for troubleshooting): '/home/cip4secretariat/bamboo/agent-1/xml-data/build-dir/LIB-XPTKLIB-LINUX/build/tmp/javadoc/javadoc.options'

* Try:
Run with --stacktrace option to get the stack trace. Run with --info or --debug option to get more log output. Run with --scan to get full insights.

* Get more help at https://help.gradle.org

BUILD FAILED in 25s