Build #99

development 1.x schema generation

Build: #99 failed Changes by R2 D2 and Graham Mann <graham.mann@bilney.co.uk>

Stages & jobs

  1. Default Stage

Logs

The following logs have been generated by the jobs in this plan.
  • Expand all
  • Collapse all
Job Logs
Collapse samples Default Stage Download or View
03-Mär-2020 19:03:12 > Task :testClasses UP-TO-DATE
03-Mär-2020 19:03:12 > Task :test NO-SOURCE
03-Mär-2020 19:03:26
03-Mär-2020 19:03:26 > Task :buildSamples
03-Mär-2020 19:03:26 line 1:6 no viable alternative at input 'version'
03-Mär-2020 19:03:26 line 1:6 no viable alternative at input 'version'
03-Mär-2020 19:03:26 line 8:31 no viable alternative at input '<DeviceCap PartIDKeys '
03-Mär-2020 19:03:26 line 148:1 no viable alternative at input '</'
03-Mär-2020 19:03:26
03-Mär-2020 19:03:26 > Task :buildSamples FAILED
03-Mär-2020 19:03:26 2 actionable tasks: 1 executed, 1 up-to-date
03-Mär-2020 19:03:26
03-Mär-2020 19:03:26 FAILURE: Build failed with an exception.
03-Mär-2020 19:03:26
03-Mär-2020 19:03:26 * What went wrong:
03-Mär-2020 19:03:26 Execution failed for task ':buildSamples'.
03-Mär-2020 19:03:26 > assert false
03-Mär-2020 19:03:26
03-Mär-2020 19:03:26
03-Mär-2020 19:03:26 * Try:
03-Mär-2020 19:03:26 Run with --stacktrace option to get the stack trace. Run with --info or --debug option to get more log output. Run with --scan to get full insights.
03-Mär-2020 19:03:26
03-Mär-2020 19:03:26 * Get more help at https://help.gradle.org
03-Mär-2020 19:03:26
03-Mär-2020 19:03:26 BUILD FAILED in 48s