Build result summary

Details

Completed
Duration
2426 minutes
Labels
None
Agent
Windows Agent #2
Revisions
PrintTalk Schema
0cb53db5d79eb59b149209511cf740161534319f 0cb53db5d79eb59b149209511cf740161534319f
Sample Builder
2a18aae1377e56419abbd9f753cd0190230bdb29 2a18aae1377e56419abbd9f753cd0190230bdb29
Specification
ca251c0e0545bba0e99fa61918c1db75a21db498 ca251c0e0545bba0e99fa61918c1db75a21db498
Fixed in
#15 (Manual run by Rainer Prosi)

No failed tests found, a possible compilation error occurred.

Responsible

No one has taken responsibility for this failure

Code commits

PrintTalk Schema
Author Commit Message Commit date
Rainer Prosi <rainer.prosi@heidelberg.com> Rainer Prosi <rainer.prosi@heidelberg.com> 0cb53db5d79eb59b149209511cf740161534319f 0cb53db5d79eb59b149209511cf740161534319f PTK-218
Specification
Author Commit Message Commit date
Graham Mann <graham.mann@bilney.co.uk> Graham Mann <graham.mann@bilney.co.uk> ca251c0e0545bba0e99fa61918c1db75a21db498 ca251c0e0545bba0e99fa61918c1db75a21db498 PTK-215 Fixed editorial typos.
Graham Mann <graham.mann@bilney.co.uk> Graham Mann <graham.mann@bilney.co.uk> bfd6aeb23b2c6e1baf5e080becb1b76683711fe8 bfd6aeb23b2c6e1baf5e080becb1b76683711fe8 PTK-215 Revised interaction between returning resource audits and milestones.
Graham Mann <graham.mann@bilney.co.uk> Graham Mann <graham.mann@bilney.co.uk> 3438036bf97cd5e7721918d9042b86f7bbeb2989 3438036bf97cd5e7721918d9042b86f7bbeb2989 PTK-220 Reordered/factored system building to remove HTTP Content-Type paragraph.
Graham Mann <graham.mann@bilney.co.uk> Graham Mann <graham.mann@bilney.co.uk> 2b6efb9c11bac6899a0617baa7495c8cf1a20de2 2b6efb9c11bac6899a0617baa7495c8cf1a20de2 PTK-221 Added existing examples.

JIRA issues

IssueDescriptionStatus
Unknown Issue TypePTK-215Could not obtain issue details from JIRA
Unknown Issue TypePTK-218Could not obtain issue details from JIRA
Unknown Issue TypePTK-220Could not obtain issue details from JIRA
Unknown Issue TypePTK-221Could not obtain issue details from JIRA

Error summary for samples

The job generated some errors, drill down into the full build log for more details.

line 1:6 no viable alternative at input 'version'
line 1:0 no viable alternative at input '<EOF>'

FAILURE: Build failed with an exception.

* What went wrong:
Execution failed for task ':gitPublish'.
> org.eclipse.jgit.api.errors.TransportException: ssh://git@bitbucket.cip4.org:7999/spec/printtalk-specification.git: Session.connect: java.io.IOException: End of IO Stream Read

* Try:
Run with --stacktrace option to get the stack trace. Run with --info or --debug option to get more log output. Run with --scan to get full insights.

* Get more help at https://help.gradle.org

BUILD FAILED in 7m 29s