Logs

The following logs have been generated by the jobs in this plan.
  • Expand all
  • Collapse all
Job Logs
Collapse samples Default Stage Download or View
10-Aug-2019 16:02:48 > Task :testClasses UP-TO-DATE
10-Aug-2019 16:02:48 > Task :test NO-SOURCE
10-Aug-2019 16:02:52
10-Aug-2019 16:02:52 > Task :buildSamples
10-Aug-2019 16:02:52 line 1:6 no viable alternative at input 'version'
10-Aug-2019 16:02:52 line 1:0 no viable alternative at input '<EOF>'
10-Aug-2019 16:02:54
10-Aug-2019 16:02:54 > Task :gitPublish
10-Aug-2019 16:02:54 publish...
10-Aug-2019 16:07:25
10-Aug-2019 16:07:25 > Task :gitPublish FAILED
10-Aug-2019 16:07:25 3 actionable tasks: 2 executed, 1 up-to-date
10-Aug-2019 16:07:25
10-Aug-2019 16:07:25 FAILURE: Build failed with an exception.
10-Aug-2019 16:07:25
10-Aug-2019 16:07:25 * What went wrong:
10-Aug-2019 16:07:25 Execution failed for task ':gitPublish'.
10-Aug-2019 16:07:25 > org.eclipse.jgit.api.errors.TransportException: ssh://git@bitbucket.cip4.org:7999/spec/printtalk-specification.git: Session.connect: java.io.IOException: End of IO Stream Read
10-Aug-2019 16:07:25
10-Aug-2019 16:07:25 * Try:
10-Aug-2019 16:07:25 Run with --stacktrace option to get the stack trace. Run with --info or --debug option to get more log output. Run with --scan to get full insights.
10-Aug-2019 16:07:25
10-Aug-2019 16:07:25 * Get more help at https://help.gradle.org
10-Aug-2019 16:07:25
10-Aug-2019 16:07:25 BUILD FAILED in 7m 29s