Build result summary

Details

Completed
Duration
2400 minutes
Labels
None
Agent
Windows Agent #2
Revisions
PrintTalk Schema
61d0584a7941ca55bb9fea9ef82e16b65854f589 61d0584a7941ca55bb9fea9ef82e16b65854f589
Sample Builder
2a18aae1377e56419abbd9f753cd0190230bdb29 2a18aae1377e56419abbd9f753cd0190230bdb29
Specification
ca251c0e0545bba0e99fa61918c1db75a21db498 ca251c0e0545bba0e99fa61918c1db75a21db498
Failing since
#12 (Changes by Rainer Prosi <rainer.prosi@heidelberg.com> and Graham Mann <graham.mann@bilney.co.uk>)

No failed tests found, a possible compilation error occurred.

Responsible

This build has been failing since #12
No one has taken responsibility

Code commits

PrintTalk Schema
Author Commit Message Commit date
Rainer Prosi <rainer.prosi@heidelberg.com> Rainer Prosi <rainer.prosi@heidelberg.com> 61d0584a7941ca55bb9fea9ef82e16b65854f589 61d0584a7941ca55bb9fea9ef82e16b65854f589 PTK-215

JIRA issues

IssueDescriptionStatus
Unknown Issue TypePTK-215Could not obtain issue details from JIRA

Error summary for samples

The job generated some errors, drill down into the full build log for more details.

line 1:6 no viable alternative at input 'version'
line 1:0 no viable alternative at input '<EOF>'

FAILURE: Build failed with an exception.

* What went wrong:
Execution failed for task ':gitPublish'.
> org.eclipse.jgit.api.errors.TransportException: ssh://git@bitbucket.cip4.org:7999/spec/printtalk-specification.git: Session.connect: java.io.IOException: End of IO Stream Read

* Try:
Run with --stacktrace option to get the stack trace. Run with --info or --debug option to get more log output. Run with --scan to get full insights.

* Get more help at https://help.gradle.org

BUILD FAILED in 5m 47s