Build: #14 failed Rebuilt by Rainer Prosi

Build result summary

Details

Completed
Duration
3 minutes
Flags
Rebuild
Labels
None
Agent
Windows Agent #2
Revisions
PrintTalk Schema
2d05ff009663bd0ed5d19066fd873799ee7ea619 2d05ff009663bd0ed5d19066fd873799ee7ea619
Sample Builder
2a18aae1377e56419abbd9f753cd0190230bdb29 2a18aae1377e56419abbd9f753cd0190230bdb29
Specification
ca251c0e0545bba0e99fa61918c1db75a21db498 ca251c0e0545bba0e99fa61918c1db75a21db498
Failing since
#12 (Changes by Rainer Prosi <rainer.prosi@heidelberg.com> and Graham Mann <graham.mann@bilney.co.uk>)
Fixed in
#15 (Manual run by Rainer Prosi)
Number of retries
1

No failed tests found, a possible compilation error occurred.

Responsible

This build has been failing since #12
No one has taken responsibility

Code commits

PrintTalk Schema
Author Commit Message Commit date
Rainer Prosi <rainer.prosi@heidelberg.com> Rainer Prosi <rainer.prosi@heidelberg.com> 2d05ff009663bd0ed5d19066fd873799ee7ea619 2d05ff009663bd0ed5d19066fd873799ee7ea619 PTK-221 updated example

JIRA issues

IssueDescriptionStatus
Unknown Issue TypePTK-221Could not obtain issue details from JIRA

Error summary for samples

The job generated some errors, drill down into the full build log for more details.

line 1:0 no viable alternative at input '<EOF>'

FAILURE: Build failed with an exception.

* What went wrong:
Execution failed for task ':gitPublish'.
> org.eclipse.jgit.api.errors.TransportException: Nothing to push.

* Try:
Run with --stacktrace option to get the stack trace. Run with --info or --debug option to get more log output. Run with --scan to get full insights.

* Get more help at https://help.gradle.org

BUILD FAILED in 2m 47s

Error log

    Agent 'Windows Agent #1' went offline while building SCHEMES-PTKS-SAM-14. The results of that build will not be available.

    (18 Aug 2019, 4:28:53 PM)