Build: #14 failed Rebuilt by Rainer Prosi

Logs

The following logs have been generated by the jobs in this plan.
  • Expand all
  • Collapse all
Job Logs
Collapse samples Default Stage Download or View
26-Aug-2019 21:04:15 > Task :processTestResources NO-SOURCE
26-Aug-2019 21:04:15 > Task :testClasses UP-TO-DATE
26-Aug-2019 21:04:15 > Task :test NO-SOURCE
26-Aug-2019 21:04:17
26-Aug-2019 21:04:17 > Task :buildSamples
26-Aug-2019 21:04:17 line 1:0 no viable alternative at input '<EOF>'
26-Aug-2019 21:04:19
26-Aug-2019 21:04:19 > Task :gitPublish
26-Aug-2019 21:04:19 publish...
26-Aug-2019 21:05:38
26-Aug-2019 21:05:38 FAILURE: Build failed with an exception.
26-Aug-2019 21:05:38
26-Aug-2019 21:05:38 * What went wrong:
26-Aug-2019 21:05:38 Execution failed for task ':gitPublish'.
26-Aug-2019 21:05:38 > org.eclipse.jgit.api.errors.TransportException: Nothing to push.
26-Aug-2019 21:05:38
26-Aug-2019 21:05:38 * Try:
26-Aug-2019 21:05:38 Run with --stacktrace option to get the stack trace. Run with --info or --debug option to get more log output. Run with --scan to get full insights.
26-Aug-2019 21:05:38
26-Aug-2019 21:05:38 * Get more help at https://help.gradle.org
26-Aug-2019 21:05:38
26-Aug-2019 21:05:38 BUILD FAILED in 2m 47s
26-Aug-2019 21:05:38
26-Aug-2019 21:05:38 > Task :gitPublish FAILED
26-Aug-2019 21:05:38 3 actionable tasks: 2 executed, 1 up-to-date