Build: #12 failed

Job: samples failed

Stages & jobs

  1. Default Stage

Job result summary

Completed
Duration
7 minutes
Agent
Windows Agent #2
Revisions
PrintTalk Schema
0cb53db5d79eb59b149209511cf740161534319f 0cb53db5d79eb59b149209511cf740161534319f
Sample Builder
2a18aae1377e56419abbd9f753cd0190230bdb29 2a18aae1377e56419abbd9f753cd0190230bdb29
Specification
ca251c0e0545bba0e99fa61918c1db75a21db498 ca251c0e0545bba0e99fa61918c1db75a21db498
Fixed in
#15 (Manual run by Rainer Prosi)

No failed tests found, a possible compilation error occurred.

Error summary

The build generated some errors. See the full build log for more details.

line 1:6 no viable alternative at input 'version'
line 1:0 no viable alternative at input '<EOF>'

FAILURE: Build failed with an exception.

* What went wrong:
Execution failed for task ':gitPublish'.
> org.eclipse.jgit.api.errors.TransportException: ssh://git@bitbucket.cip4.org:7999/spec/printtalk-specification.git: Session.connect: java.io.IOException: End of IO Stream Read

* Try:
Run with --stacktrace option to get the stack trace. Run with --info or --debug option to get more log output. Run with --scan to get full insights.

* Get more help at https://help.gradle.org

BUILD FAILED in 7m 29s