Build: #14 failed

Job: samples failed

Stages & jobs

  1. Default Stage

Job result summary

2 minutes
Windows Agent #2
PrintTalk Schema
2d05ff009663bd0ed5d19066fd873799ee7ea619 2d05ff009663bd0ed5d19066fd873799ee7ea619
Sample Builder
2a18aae1377e56419abbd9f753cd0190230bdb29 2a18aae1377e56419abbd9f753cd0190230bdb29
ca251c0e0545bba0e99fa61918c1db75a21db498 ca251c0e0545bba0e99fa61918c1db75a21db498
Failing since
#13 (Code changes detected – )
Fixed in
#15 (Manual run by Rainer Prosi)
Number of retries
No failed test found. A possible compilation error occurred.

Error summary

The build generated some errors. See the full build log for more details.

line 1:0 no viable alternative at input '<EOF>'

FAILURE: Build failed with an exception.

* What went wrong:
Execution failed for task ':gitPublish'.
> org.eclipse.jgit.api.errors.TransportException: Nothing to push.

* Try:
Run with --stacktrace option to get the stack trace. Run with --info or --debug option to get more log output. Run with --scan to get full insights.

* Get more help at

BUILD FAILED in 2m 47s