Build: #14 failed

Job: samples failed

Stages & jobs

  1. Default Stage

Build log

The build generated 134 lines of output. Download or view full build log

26-Aug-2019 21:02:13 Build Schemes - PrintTalk Schema - samples #14 (SCHEMES-PTKS-SAM-14) started building on agent h2594590.stratoserver.net
26-Aug-2019 21:02:13 Remote agent on host h2594590.stratoserver.net
26-Aug-2019 21:02:14 Build working directory is D:\bamboo\agent-2\xml-data\build-dir\SCHEMES-PTKS-SAM
26-Aug-2019 21:02:14 Executing build Schemes - PrintTalk Schema - samples #14 (SCHEMES-PTKS-SAM-14)
26-Aug-2019 21:02:15 Starting task 'Source Code Checkout' of type 'com.atlassian.bamboo.plugins.vcs:task.vcs.checkout'
26-Aug-2019 21:02:15 Build always requires a clean checkout
26-Aug-2019 21:02:15 Cleaning build directory 'D:\bamboo\agent-2\xml-data\build-dir\SCHEMES-PTKS-SAM\schema'
26-Aug-2019 21:02:15 Build always requires a clean checkout
26-Aug-2019 21:02:15 Cleaning build directory 'D:\bamboo\agent-2\xml-data\build-dir\SCHEMES-PTKS-SAM\sample-builder'
26-Aug-2019 21:02:16 Build always requires a clean checkout
26-Aug-2019 21:02:16 Cleaning build directory 'D:\bamboo\agent-2\xml-data\build-dir\SCHEMES-PTKS-SAM\spec'
26-Aug-2019 21:02:17 Updating source code to revision: 2d05ff009663bd0ed5d19066fd873799ee7ea619
26-Aug-2019 21:02:18 Creating local git repository in 'D:\bamboo\agent-2\xml-data\build-dir\SCHEMES-PTKS-SAM\schema\.git'.
26-Aug-2019 21:02:18 Initialized empty Git repository in D:/bamboo/agent-2/xml-data/build-dir/SCHEMES-PTKS-SAM/schema/.git/
26-Aug-2019 21:02:26 Fetching 'refs/heads/master' from 'ssh://git@bitbucket.cip4.org:7999/schema/printtalk-schema.git'. Will try to do a shallow fetch.
26-Aug-2019 21:02:27 Warning: Permanently added '[127.0.0.1]:54120' (RSA) to the list of known hosts.
26-Aug-2019 21:02:31 From ssh://127.0.0.1:54120/schema/printtalk-schema
26-Aug-2019 21:02:31 * [new branch]      master     -> master
26-Aug-2019 21:02:31 Checking out revision 2d05ff009663bd0ed5d19066fd873799ee7ea619.
26-Aug-2019 21:02:31 Already on 'master'
26-Aug-2019 21:02:32 Updated source code to revision: 2d05ff009663bd0ed5d19066fd873799ee7ea619
26-Aug-2019 21:02:32 Updating source code to revision: 2a18aae1377e56419abbd9f753cd0190230bdb29
26-Aug-2019 21:02:35 Fetching 'refs/heads/master' from 'ssh://git@bitbucket.cip4.org:7999/spec/sample-builder.git'.
26-Aug-2019 21:02:35 Warning: Permanently added '[127.0.0.1]:54120' (RSA) to the list of known hosts.
26-Aug-2019 21:02:37 Checking out revision 2a18aae1377e56419abbd9f753cd0190230bdb29.
26-Aug-2019 21:02:37 Creating local git repository in 'D:\bamboo\agent-2\xml-data\build-dir\SCHEMES-PTKS-SAM\sample-builder\.git'.
26-Aug-2019 21:02:37 Cloning into 'D:\bamboo\agent-2\xml-data\build-dir\SCHEMES-PTKS-SAM\sample-builder'...
26-Aug-2019 21:02:37 done.
26-Aug-2019 21:02:37 Already on 'master'
26-Aug-2019 21:02:37 Your branch is up-to-date with 'origin/master'.
26-Aug-2019 21:02:37 Updated source code to revision: 2a18aae1377e56419abbd9f753cd0190230bdb29
26-Aug-2019 21:02:37 Updating source code to revision: ca251c0e0545bba0e99fa61918c1db75a21db498
26-Aug-2019 21:02:39 Fetching 'refs/heads/master' from 'ssh://git@bitbucket.cip4.org:7999/spec/printtalk-specification.git'.
26-Aug-2019 21:02:39 Warning: Permanently added '[127.0.0.1]:54120' (RSA) to the list of known hosts.
26-Aug-2019 21:02:46 From ssh://127.0.0.1:54120/spec/printtalk-specification
26-Aug-2019 21:02:46    ca251c0..641e735  master     -> master
26-Aug-2019 21:02:46 Checking out revision ca251c0e0545bba0e99fa61918c1db75a21db498.
26-Aug-2019 21:02:46 Creating local git repository in 'D:\bamboo\agent-2\xml-data\build-dir\SCHEMES-PTKS-SAM\spec\.git'.
26-Aug-2019 21:02:46 Cloning into 'D:\bamboo\agent-2\xml-data\build-dir\SCHEMES-PTKS-SAM\spec'...
26-Aug-2019 21:02:46 done.
26-Aug-2019 21:02:49 Note: checking out 'ca251c0e0545bba0e99fa61918c1db75a21db498'.
26-Aug-2019 21:02:49
26-Aug-2019 21:02:49 You are in 'detached HEAD' state. You can look around, make experimental
26-Aug-2019 21:02:49 changes and commit them, and you can discard any commits you make in this
26-Aug-2019 21:02:49 state without impacting any branches by performing another checkout.
26-Aug-2019 21:02:49
26-Aug-2019 21:02:49 If you want to create a new branch to retain commits you create, you may
26-Aug-2019 21:02:49 do so (now or later) by using -b with the checkout command again. Example:
26-Aug-2019 21:02:49
26-Aug-2019 21:02:49   git checkout -b <new-branch-name>
26-Aug-2019 21:02:49
26-Aug-2019 21:02:49 HEAD is now at ca251c0... PTK-215 Fixed editorial typos.
26-Aug-2019 21:02:49 Updated source code to revision: ca251c0e0545bba0e99fa61918c1db75a21db498
26-Aug-2019 21:02:49 Finished task 'Source Code Checkout' with result: Success
26-Aug-2019 21:02:49 Running pre-build action: VCS Version Collector
26-Aug-2019 21:02:50 Starting task 'publish samples' of type 'com.atlassian.bamboo.plugins.scripttask:task.builder.script'
26-Aug-2019 21:02:50
Beginning to execute external process for build 'Schemes - PrintTalk Schema - samples #14 (SCHEMES-PTKS-SAM-14)'
... running command line:
D:\bamboo\agent-2\temp\SCHEMES-PTKS-SAM-14-ScriptBuildTask-6731834113904355627.bat
... in: D:\bamboo\agent-2\xml-data\build-dir\SCHEMES-PTKS-SAM\schema
... using extra environment variables:
bamboo_planRepository_1_branch=master
bamboo_planRepository_2_branch=master
bamboo_capability_operating_system_windows=Windows Server 2012 R2 Standard
bamboo_planRepository_1_branchDisplayName=master
bamboo_repository_55672840_revision_number=2d05ff009663bd0ed5d19066fd873799ee7ea619
bamboo_repository_revision_number=2d05ff009663bd0ed5d19066fd873799ee7ea619
bamboo_planRepository_3_type=bbserver
bamboo_resultsUrl=https://bamboo.cip4.org/browse/SCHEMES-PTKS-SAM-14
bamboo_capability_system_builder_msbuild_MSBuild_v4_0__32bit_=C:\Windows\Microsoft.NET\Framework\v4.0.30319\MSBuild.exe
bamboo_repository_55672837_name=Sample Builder
bamboo_planRepository_1_name=PrintTalk Schema
bamboo_build_working_directory=D:\bamboo\agent-2\xml-data\build-dir\SCHEMES-PTKS-SAM
bamboo_planRepository_3_revision=ca251c0e0545bba0e99fa61918c1db75a21db498
bamboo_buildKey=SCHEMES-PTKS-SAM
bamboo_shortPlanName=PrintTalk Schema
bamboo_repository_55672837_git_username=
bamboo_planRepository_2_username=
bamboo_planRepository_name=PrintTalk Schema
bamboo_repository_55672840_git_repositoryUrl=ssh://git@bitbucket.cip4.org:7999/schema/printtalk-schema.git
bamboo_buildNumber=14
bamboo_planRepository_3_branch=master
bamboo_repository_55672840_git_username=
bamboo_planRepository_2_branchDisplayName=master
bamboo_shortJobName=samples
bamboo_buildResultsUrl=https://bamboo.cip4.org/browse/SCHEMES-PTKS-SAM-14
bamboo_planRepository_repositoryUrl=ssh://git@bitbucket.cip4.org:7999/schema/printtalk-schema.git
bamboo_repository_55672840_git_branch=master
bamboo_repository_55672840_branch_name=master
bamboo_agentId=33751042
bamboo_planName=Schemes - PrintTalk Schema
bamboo_shortPlanKey=PTKS
bamboo_shortJobKey=SAM
bamboo_planRepository_2_name=Sample Builder
bamboo_repository_55672840_name=PrintTalk Schema
bamboo_planRepository_revision=2d05ff009663bd0ed5d19066fd873799ee7ea619
bamboo_repository_55672837_revision_number=2a18aae1377e56419abbd9f753cd0190230bdb29
bamboo_buildTimeStamp=2019-08-26T21:01:57.423+02:00
bamboo_buildResultKey=SCHEMES-PTKS-SAM-14
bamboo_repository_git_branch=master
bamboo_repository_branch_name=master
bamboo_buildPlanName=Schemes - PrintTalk Schema - samples
bamboo_repository_55672838_name=Specification
bamboo_capability_system_jdk_JDK_1_8_0_101=C:\Program Files\Java\jdk1.8.0_101
bamboo_planRepository_1_revision=2d05ff009663bd0ed5d19066fd873799ee7ea619
bamboo_planRepository_3_username=
bamboo_repository_name=Specification
bamboo_repository_55672837_git_repositoryUrl=ssh://git@bitbucket.cip4.org:7999/spec/sample-builder.git
bamboo_buildFailed=false
bamboo_planRepository_3_repositoryUrl=ssh://git@bitbucket.cip4.org:7999/spec/printtalk-specification.git
bamboo_repository_55672838_git_username=
bamboo_planRepository_branch=master
bamboo_repository_55672838_branch_name=master
bamboo_repository_55672837_branch_name=master
bamboo_repository_55672838_git_branch=master
bamboo_agentWorkingDirectory=D:\bamboo\agent-2\xml-data\build-dir
bamboo_planRepository_2_revision=2a18aae1377e56419abbd9f753cd0190230bdb29
bamboo_capability_system_git_executable=C:\Program Files\Git\cmd\git.exe
bamboo_repository_git_username=
bamboo_planRepository_3_branchName=master
bamboo_planRepository_branchDisplayName=master
bamboo_planRepository_1_type=bbserver
bamboo_planRepository_branchName=master
bamboo_repository_55672838_revision_number=ca251c0e0545bba0e99fa61918c1db75a21db498
bamboo_planRepository_2_type=bbserver
bamboo_capability_system_builder_mvn3_Maven_3_x=C:\Program Files\apache-maven
bamboo_repository_55672837_git_branch=master
bamboo_planRepository_3_name=Specification
bamboo_capability_system_jdk_JDK=C:\Program Files\Java\jdk1.8.0_101
bamboo_plan_storageTag=plan-55771138
bamboo_planRepository_2_repositoryUrl=ssh://git@bitbucket.cip4.org:7999/spec/sample-builder.git
bamboo_planRepository_type=bbserver
bamboo_planRepository_1_username=
bamboo_repository_git_repositoryUrl=ssh://git@bitbucket.cip4.org:7999/schema/printtalk-schema.git
bamboo_planRepository_2_branchName=master
bamboo_capability_system_builder_msbuild_MSBuild_v4_0__64bit_=C:\Windows\Microsoft.NET\Framework64\v4.0.30319\MSBuild.exe
bamboo_planRepository_3_branchDisplayName=master
bamboo_working_directory=D:\bamboo\agent-2\xml-data\build-dir\SCHEMES-PTKS-SAM
bamboo_planKey=SCHEMES-PTKS
bamboo_planRepository_1_repositoryUrl=ssh://git@bitbucket.cip4.org:7999/schema/printtalk-schema.git
bamboo_planRepository_username=
bamboo_capability_system_jdk_JDK_1_8=C:\Program Files\Java\jdk1.8.0_101
bamboo_planRepository_1_branchName=master
bamboo_repository_55672838_git_repositoryUrl=ssh://git@bitbucket.cip4.org:7999/spec/printtalk-specification.git
26-Aug-2019 21:02:50
26-Aug-2019 21:02:50 D:\bamboo\agent-2\xml-data\build-dir\SCHEMES-PTKS-SAM\schema>./gradlew --include-build ../sample-builder clean gitPublish
26-Aug-2019 21:03:31 > Task :sample-builder:buildSrc:compileJava NO-SOURCE
26-Aug-2019 21:03:31 > Task :sample-builder:buildSrc:compileGroovy NO-SOURCE
26-Aug-2019 21:03:31 > Task :sample-builder:buildSrc:processResources NO-SOURCE
26-Aug-2019 21:03:31 > Task :sample-builder:buildSrc:classes UP-TO-DATE
26-Aug-2019 21:03:33 > Task :sample-builder:buildSrc:jar
26-Aug-2019 21:03:33 > Task :sample-builder:buildSrc:assemble
26-Aug-2019 21:03:33 > Task :sample-builder:buildSrc:compileTestJava NO-SOURCE
26-Aug-2019 21:03:33 > Task :sample-builder:buildSrc:compileTestGroovy NO-SOURCE
26-Aug-2019 21:03:33 > Task :sample-builder:buildSrc:processTestResources NO-SOURCE
26-Aug-2019 21:03:33 > Task :sample-builder:buildSrc:testClasses UP-TO-DATE
26-Aug-2019 21:03:33 > Task :sample-builder:buildSrc:test NO-SOURCE
26-Aug-2019 21:03:33 > Task :sample-builder:buildSrc:check UP-TO-DATE
26-Aug-2019 21:03:33 > Task :sample-builder:buildSrc:build
26-Aug-2019 21:03:51 > Task :sample-builder:generateGrammarSource
26-Aug-2019 21:04:01 > Task :sample-builder:compileJava
26-Aug-2019 21:04:11
26-Aug-2019 21:04:11 > Task :sample-builder:compileGroovy
26-Aug-2019 21:04:11 Could not open/create prefs root node Software\JavaSoft\Prefs at root 0x80000002. Windows RegCreateKeyEx(...) returned error code 5.
26-Aug-2019 21:04:12
26-Aug-2019 21:04:12 > Task :sample-builder:pluginDescriptors
26-Aug-2019 21:04:12 > Task :sample-builder:processResources
26-Aug-2019 21:04:12 > Task :sample-builder:classes
26-Aug-2019 21:04:12 > Task :sample-builder:jar
26-Aug-2019 21:04:14 > Task :clean UP-TO-DATE
26-Aug-2019 21:04:15 > Task :compileJava NO-SOURCE
26-Aug-2019 21:04:15 > Task :compileGroovy NO-SOURCE
26-Aug-2019 21:04:15 > Task :processResources NO-SOURCE
26-Aug-2019 21:04:15 > Task :classes UP-TO-DATE
26-Aug-2019 21:04:15 > Task :compileTestJava NO-SOURCE
26-Aug-2019 21:04:15 > Task :compileTestGroovy NO-SOURCE
26-Aug-2019 21:04:15 > Task :processTestResources NO-SOURCE
26-Aug-2019 21:04:15 > Task :testClasses UP-TO-DATE
26-Aug-2019 21:04:15 > Task :test NO-SOURCE
26-Aug-2019 21:04:17
26-Aug-2019 21:04:17 > Task :buildSamples
26-Aug-2019 21:04:17 line 1:0 no viable alternative at input '<EOF>'
26-Aug-2019 21:04:19
26-Aug-2019 21:04:19 > Task :gitPublish
26-Aug-2019 21:04:19 publish...
26-Aug-2019 21:05:38
26-Aug-2019 21:05:38 FAILURE: Build failed with an exception.
26-Aug-2019 21:05:38
26-Aug-2019 21:05:38 * What went wrong:
26-Aug-2019 21:05:38 Execution failed for task ':gitPublish'.
26-Aug-2019 21:05:38 > org.eclipse.jgit.api.errors.TransportException: Nothing to push.
26-Aug-2019 21:05:38
26-Aug-2019 21:05:38 * Try:
26-Aug-2019 21:05:38 Run with --stacktrace option to get the stack trace. Run with --info or --debug option to get more log output. Run with --scan to get full insights.
26-Aug-2019 21:05:38
26-Aug-2019 21:05:38 * Get more help at https://help.gradle.org
26-Aug-2019 21:05:38
26-Aug-2019 21:05:38 BUILD FAILED in 2m 47s
26-Aug-2019 21:05:38
26-Aug-2019 21:05:38 > Task :gitPublish FAILED
26-Aug-2019 21:05:38 3 actionable tasks: 2 executed, 1 up-to-date
26-Aug-2019 21:05:40 Failing task since return code of [D:\bamboo\agent-2\temp\SCHEMES-PTKS-SAM-14-ScriptBuildTask-6731834113904355627.bat] was 1 while expected 0
26-Aug-2019 21:05:40 Finished task 'publish samples' with result: Failed
26-Aug-2019 21:05:40 Running post build plugin 'Docker Container Cleanup'
26-Aug-2019 21:05:40 Running post build plugin 'NCover Results Collector'
26-Aug-2019 21:05:41 Running post build plugin 'Clover Results Collector'
26-Aug-2019 21:05:41 Running post build plugin 'npm Cache Cleanup'
26-Aug-2019 21:05:41 Running post build plugin 'Artifact Copier'
26-Aug-2019 21:05:41 Finalising the build...
26-Aug-2019 21:05:41 Stopping timer.
26-Aug-2019 21:05:41 Build SCHEMES-PTKS-SAM-14 completed.
26-Aug-2019 21:05:44 Running on server: post build plugin 'NCover Results Collector'
26-Aug-2019 21:05:44 Running on server: post build plugin 'Build Hanging Detection Configuration'
26-Aug-2019 21:05:44 Running on server: post build plugin 'Clover Delta Calculator'
26-Aug-2019 21:05:44 Running on server: post build plugin 'Maven Dependencies Postprocessor'
26-Aug-2019 21:05:44 All post build plugins have finished
26-Aug-2019 21:05:44 Generating build results summary...
26-Aug-2019 21:05:44 Saving build results to disk...
26-Aug-2019 21:05:44 Logging substituted variables...
26-Aug-2019 21:05:44 Indexing build results...
26-Aug-2019 21:05:44 Finished building SCHEMES-PTKS-SAM-14.