Build #417

Build result summary

Details

Completed
Duration
29 minutes
Labels
None
Agent
Windows Agent #1
Revisions
XJDF Schema
35469d9bfd56989b23cbc0b2dab329a4432b612f 35469d9bfd56989b23cbc0b2dab329a4432b612f
Sample Builder
2a18aae1377e56419abbd9f753cd0190230bdb29 2a18aae1377e56419abbd9f753cd0190230bdb29
Specification
5b7462a5e84edab5a7520ca642d8c3b4db66489d 5b7462a5e84edab5a7520ca642d8c3b4db66489d
Total tests
223
Fixed in
#419 (Changes by Rainer Prosi <rainer.prosi@heidelberg.com>)

Tests

Responsible

No one has taken responsibility for this failure

Code commits

XJDF Schema
Author Commit Message Commit date
Rainer Prosi <rainer.prosi@heidelberg.com> Rainer Prosi <rainer.prosi@heidelberg.com> 35469d9bfd56989b23cbc0b2dab329a4432b612f 35469d9bfd56989b23cbc0b2dab329a4432b612f JDF-727
Specification
Author Commit Message Commit date
Graham Mann <graham.mann@bilney.co.uk> Graham Mann <graham.mann@bilney.co.uk> 5b7462a5e84edab5a7520ca642d8c3b4db66489d 5b7462a5e84edab5a7520ca642d8c3b4db66489d JDF-684 Minor typos/references while preparing to do the complete trawl.
Graham Mann <graham.mann@bilney.co.uk> Graham Mann <graham.mann@bilney.co.uk> f80cd7bb04950142e44a0c592be47297a9618379 f80cd7bb04950142e44a0c592be47297a9618379 JDF-632 Fixed description of ColorMeasurement and added proper references in the header of the sub-element.
Graham Mann <graham.mann@bilney.co.uk> Graham Mann <graham.mann@bilney.co.uk> f5b283a92b37b5845d2c101847b501218313f594 f5b283a92b37b5845d2c101847b501218313f594 JDF-594 Added new references to the Certification sub-element.
Graham Mann <graham.mann@bilney.co.uk> Graham Mann <graham.mann@bilney.co.uk> c87d2e8968f97b3f6bc3f73716cbbd1fb1d82871 c87d2e8968f97b3f6bc3f73716cbbd1fb1d82871 JDF-726 Cleaned up spurious New in XJDF in introduction chapter.

Tests

New test failures 4
Status Test View job Duration
Collapse Failed XjdfSchemaValidation testInvalidPackages(File)[38] History
build SNAPSHOT < 1 sec
org.xml.sax.SAXParseException: org.xml.sax.SAXParseException; lineNumber: 21; columnNumber: 65; cvc-complex-type.4: Attribute 'OrderQuantity' must appear on element 'GangElement'.
org.xml.sax.SAXParseException; lineNumber: 21; columnNumber: 65; cvc-complex-type.4: Attribute 'OrderQuantity' must appear on element 'GangElement'.
	at com.sun.org.apache.xerces.internal.util.ErrorHandlerWrapper.createSAXParseException(ErrorHandlerWrapper.java:203)
	at com.sun.org.apache.xerces.internal.util.ErrorHandlerWrapper.error(ErrorHandlerWrapper.java:134)
	at com.sun.org.apache.xerces.internal.impl.XMLErrorReporter.reportError(XMLErrorReporter.java:396)
	at com.sun.org.apache.xerces.internal.impl.XMLErrorReporter.reportError(XMLErrorReporter.java:327)
	at com.sun.org.apache.xerces.internal.impl.XMLErrorReporter.reportError(XMLErrorReporter.java:284)
	at com.sun.org.apache.xerces.internal.impl.xs.XMLSchemaValidator$XSIErrorReporter.reportError(XMLSchemaValidator.java:452)
(148 more lines...)
Collapse Failed XjdfSchemaValidation testInvalidPackages(File)[46] History
build SNAPSHOT < 1 sec
org.xml.sax.SAXParseException: org.xml.sax.SAXParseException; lineNumber: 27; columnNumber: 99; cvc-complex-type.4: Attribute 'OrderQuantity' must appear on element 'GangElement'.
org.xml.sax.SAXParseException; lineNumber: 27; columnNumber: 99; cvc-complex-type.4: Attribute 'OrderQuantity' must appear on element 'GangElement'.
	at com.sun.org.apache.xerces.internal.util.ErrorHandlerWrapper.createSAXParseException(ErrorHandlerWrapper.java:203)
	at com.sun.org.apache.xerces.internal.util.ErrorHandlerWrapper.error(ErrorHandlerWrapper.java:134)
	at com.sun.org.apache.xerces.internal.impl.XMLErrorReporter.reportError(XMLErrorReporter.java:396)
	at com.sun.org.apache.xerces.internal.impl.XMLErrorReporter.reportError(XMLErrorReporter.java:327)
	at com.sun.org.apache.xerces.internal.impl.XMLErrorReporter.reportError(XMLErrorReporter.java:284)
	at com.sun.org.apache.xerces.internal.impl.xs.XMLSchemaValidator$XSIErrorReporter.reportError(XMLSchemaValidator.java:452)
(148 more lines...)
Collapse Failed XjdfSchemaValidation testInvalidPackages(File)[45] History
build SNAPSHOT < 1 sec
org.xml.sax.SAXParseException: org.xml.sax.SAXParseException; lineNumber: 22; columnNumber: 65; cvc-complex-type.4: Attribute 'OrderQuantity' must appear on element 'GangElement'.
org.xml.sax.SAXParseException; lineNumber: 22; columnNumber: 65; cvc-complex-type.4: Attribute 'OrderQuantity' must appear on element 'GangElement'.
	at com.sun.org.apache.xerces.internal.util.ErrorHandlerWrapper.createSAXParseException(ErrorHandlerWrapper.java:203)
	at com.sun.org.apache.xerces.internal.util.ErrorHandlerWrapper.error(ErrorHandlerWrapper.java:134)
	at com.sun.org.apache.xerces.internal.impl.XMLErrorReporter.reportError(XMLErrorReporter.java:396)
	at com.sun.org.apache.xerces.internal.impl.XMLErrorReporter.reportError(XMLErrorReporter.java:327)
	at com.sun.org.apache.xerces.internal.impl.XMLErrorReporter.reportError(XMLErrorReporter.java:284)
	at com.sun.org.apache.xerces.internal.impl.xs.XMLSchemaValidator$XSIErrorReporter.reportError(XMLSchemaValidator.java:452)
(148 more lines...)
Collapse Failed XjdfSchemaValidation testInvalidPackages(File)[81] History
build SNAPSHOT < 1 sec
org.xml.sax.SAXParseException: org.xml.sax.SAXParseException; lineNumber: 23; columnNumber: 99; cvc-complex-type.4: Attribute 'OrderQuantity' must appear on element 'GangElement'.
org.xml.sax.SAXParseException; lineNumber: 23; columnNumber: 99; cvc-complex-type.4: Attribute 'OrderQuantity' must appear on element 'GangElement'.
	at com.sun.org.apache.xerces.internal.util.ErrorHandlerWrapper.createSAXParseException(ErrorHandlerWrapper.java:203)
	at com.sun.org.apache.xerces.internal.util.ErrorHandlerWrapper.error(ErrorHandlerWrapper.java:134)
	at com.sun.org.apache.xerces.internal.impl.XMLErrorReporter.reportError(XMLErrorReporter.java:396)
	at com.sun.org.apache.xerces.internal.impl.XMLErrorReporter.reportError(XMLErrorReporter.java:327)
	at com.sun.org.apache.xerces.internal.impl.XMLErrorReporter.reportError(XMLErrorReporter.java:284)
	at com.sun.org.apache.xerces.internal.impl.xs.XMLSchemaValidator$XSIErrorReporter.reportError(XMLSchemaValidator.java:452)
(148 more lines...)

Jira issues

IssueDescriptionStatus
8 more issues…
Unknown Issue TypeJDF-516Could not obtain issue details from Jira
Unknown Issue TypeJDF-594Could not obtain issue details from Jira
Unknown Issue TypeJDF-632Could not obtain issue details from Jira
Unknown Issue TypeJDF-639Could not obtain issue details from Jira
Unknown Issue TypeJDF-643Could not obtain issue details from Jira

Shared artifacts

Artifact File size
schema 342 KB