Build: #660 failed Child of LIB-JDFLIBJ-1348

Logs

The following logs have been generated by the jobs in this plan.
  • Expand all
  • Collapse all
Job Logs
Collapse build SNAPSHOT Default Stage Download or View
02-Okt-2019 15:22:05   xmlns:xsi="http://www.w3.org/2001/XMLSchema-instance" xsi:type="JMFRootMessage">
02-Okt-2019 15:22:05   <!--Generated by the CIP4 Java open source JDF Library version : CIP4 JDF Writer Java 1.6 BLD 015-->
02-Okt-2019 15:22:05 </JMF>
02-Okt-2019 15:22:05
02-Okt-2019 15:22:05   TemplateJMFElementFactoryTest.testCreateQueryKnownMessages:44 null
02-Okt-2019 15:22:05
02-Okt-2019 15:22:05 Tests run: 75, Failures: 3, Errors: 0, Skipped: 0
02-Okt-2019 15:22:05
02-Okt-2019 15:22:05 [INFO] ------------------------------------------------------------------------
02-Okt-2019 15:22:05 [INFO] BUILD FAILURE
02-Okt-2019 15:22:05 [INFO] ------------------------------------------------------------------------
02-Okt-2019 15:22:05 [INFO] Total time: 44.931 s
02-Okt-2019 15:22:05 [INFO] Finished at: 2019-10-02T15:22:05+02:00
02-Okt-2019 15:22:05 [INFO] Final Memory: 30M/502M
02-Okt-2019 15:22:05 [INFO] ------------------------------------------------------------------------
02-Okt-2019 15:22:05 [ERROR] Failed to execute goal org.apache.maven.plugins:maven-surefire-plugin:2.13:test (default-test) on project Alces: There are test failures.
02-Okt-2019 15:22:05 [ERROR]
02-Okt-2019 15:22:05 [ERROR] Please refer to /Users/cip4secretariat/Bamboo/bamboo-agent-2/xml-data/build-dir/TOOL-ALCES-JOB1/target/surefire-reports for the individual test results.
02-Okt-2019 15:22:05 [ERROR] -> [Help 1]
02-Okt-2019 15:22:05 [ERROR]
02-Okt-2019 15:22:05 [ERROR] To see the full stack trace of the errors, re-run Maven with the -e switch.
02-Okt-2019 15:22:05 [ERROR] Re-run Maven using the -X switch to enable full debug logging.
02-Okt-2019 15:22:05 [ERROR]
02-Okt-2019 15:22:05 [ERROR] For more information about the errors and possible solutions, please read the following articles:
02-Okt-2019 15:22:05 [ERROR] [Help 1] http://cwiki.apache.org/confluence/display/MAVEN/MojoFailureException