Build: #48 failed Release build for Alces Copenhagen-19.03 by Windsor Tanner

Logs

The following logs have been generated by the jobs in this plan.
  • Expand all
  • Collapse all
Job Logs
Collapse build RELEASE Default Stage Download or View
26-Mär-2019 16:29:09 [INFO] [INFO] ------------------------------------------------------------------------
26-Mär-2019 16:29:09 [INFO] [ERROR] Failed to execute goal org.apache.maven.plugins:maven-surefire-plugin:2.13:test (default-test) on project Alces: There are test failures.
26-Mär-2019 16:29:09 [INFO] [ERROR]
26-Mär-2019 16:29:09 [INFO] [ERROR] Please refer to /Users/cip4secretariat/Bamboo/bamboo-agent-1/xml-data/build-dir/TOOL-ALCESRELEASE-JOB1/target/surefire-reports for the individual test results.
26-Mär-2019 16:29:09 [INFO] [ERROR] -> [Help 1]
26-Mär-2019 16:29:09 [INFO] [ERROR]
26-Mär-2019 16:29:09 [INFO] [ERROR] To see the full stack trace of the errors, re-run Maven with the -e switch.
26-Mär-2019 16:29:09 [INFO] [ERROR] Re-run Maven using the -X switch to enable full debug logging.
26-Mär-2019 16:29:09 [INFO] [ERROR]
26-Mär-2019 16:29:09 [INFO] [ERROR] For more information about the errors and possible solutions, please read the following articles:
26-Mär-2019 16:29:09 [INFO] [ERROR] [Help 1] http://cwiki.apache.org/confluence/display/MAVEN/MojoFailureException
26-Mär-2019 16:29:09 [INFO] ------------------------------------------------------------------------
26-Mär-2019 16:29:09 [INFO] BUILD FAILURE
26-Mär-2019 16:29:09 [INFO] ------------------------------------------------------------------------
26-Mär-2019 16:29:09 [INFO] Total time: 41.504 s
26-Mär-2019 16:29:09 [INFO] Finished at: 2019-03-26T16:29:09+01:00
26-Mär-2019 16:29:09 [INFO] Final Memory: 12M/155M
26-Mär-2019 16:29:09 [INFO] ------------------------------------------------------------------------
26-Mär-2019 16:29:09 [ERROR] Failed to execute goal org.apache.maven.plugins:maven-release-plugin:2.5.3:prepare (default-cli) on project Alces: Maven execution failed, exit code: '1' -> [Help 1]
26-Mär-2019 16:29:09 [ERROR]
26-Mär-2019 16:29:09 [ERROR] To see the full stack trace of the errors, re-run Maven with the -e switch.
26-Mär-2019 16:29:09 [ERROR] Re-run Maven using the -X switch to enable full debug logging.
26-Mär-2019 16:29:09 [ERROR]
26-Mär-2019 16:29:09 [ERROR] For more information about the errors and possible solutions, please read the following articles:
26-Mär-2019 16:29:09 [ERROR] [Help 1] http://cwiki.apache.org/confluence/display/MAVEN/MojoExecutionException